{"text_format":"1","workbook":"xlsx","n_sheets":6,"sheets":["Planning","mode d'emploi","paramètres","jours fériés","vacances scolaires","libre"],"not_rendered":{"charts":0,"images":5,"macros":1,"external_links":0,"defined_names":71,"comments":5,"pivot_tables":0},"unopened":[],"bounds":{"document_bytes":16777216,"sheet_cells":100000,"rows_first":2000,"rows_last":500,"rows_between":2000,"halvings":0,"cell_chars":16384,"cell_head_chars":4096},"cells_cut":0,"cells_raw":0,"read":"whole","date_system":"1900"}

{"sheet":"Planning","index":0,"n_rows":37,"n_cols":73,"rows_kept":37,"cut":false,"hidden":false,"merged":[[1,68,1,72],[2,67,2,72],[2,49,2,54],[1,56,1,60],[2,55,2,60],[1,62,1,66],[2,61,2,66],[0,50,0,54],[1,14,1,18],[2,13,2,18],[1,20,1,24],[2,19,2,24],[1,38,1,42],[2,37,2,42],[1,44,1,48],[2,43,2,48],[1,50,1,54],[1,32,1,36],[2,31,2,36],[1,26,1,30],[2,25,2,30],[34,8,34,12],[1,2,1,6],[1,8,1,12],[2,7,2,12],[2,2,2,6]]}
[null,"²",null,null,null,null,null,null,null,null,null,null,null,null,null,"                  JM Stoeffler  http://www.doublevez.com",null,null," ",null,null,"                  JM Stoeffler  http://www.doublevez.com",null,null," ",null,null,"                  JM Stoeffler  http://www.doublevez.com",null,null," ",null,null,"                  JM Stoeffler  http://www.doublevez.com",null,null,"suppr\nformat->",null,"aide macro","                  JM Stoeffler  http://www.doublevez.com",null,null,"voir la video",null,"le site","                  JM Stoeffler  http://www.doublevez.com",null,null," ",null,"http://www.doublevez.com",null,null,null,null,null,null,"                  JM Stoeffler  http://www.doublevez.com",null,null," ",null,null,"                  JM Stoeffler  http://www.doublevez.com",null,null," "," "," "," "," "," "," "]
[null,null,{"$f":"C4","v":"2015-09-01"},null,null,null,null,null,{"$f":"I4","v":"2015-10-01"},null,null,null,null,null,{"$f":"O4","v":"2015-11-01"},null,null,null,null,null,{"$f":"U4","v":"2015-12-01"},null,null,null,null,null,{"$f":"AA4","v":"2016-01-01"},null,null,null,null,null,{"$f":"AG4","v":"2016-02-01"},null,null,null,null,null,{"$f":"AM4","v":"2016-03-01"},null,null,null,null,null,{"$f":"AS4","v":"2016-04-01"},null,null,null,null,null,{"$f":"AY4","v":"2016-05-01"},null,null,null,null,null,{"$f":"BE4","v":"2016-06-01"},null,null,null,null,null,{"$f":"BK4","v":"2016-07-01"},null,null,null,null,null,{"$f":"BQ4","v":"2016-08-01"}]
[null,"Bonjour !  (version du 29/08/2015)",{"$f":"IF(INT(DateEnreg)>=C4,IF(DateEnreg<MAX(C4:C34),1,0),2)","v":2},null,null,null,null,{"$f":"IF(INT(DateEnreg)>=I4,IF(DateEnreg<MAX(I4:I34),1,0),2)","v":2},null,null,null,null,null,{"$f":"IF(INT(DateEnreg)>=O4,IF(DateEnreg<MAX(O4:O34),1,0),2)","v":2},null,null,null,null,null,{"$f":"IF(INT(DateEnreg)>=U4,IF(DateEnreg<MAX(U4:U34),1,0),2)","v":2},null,null,null,null,null,{"$f":"IF(INT(DateEnreg)>=AA4,IF(DateEnreg<MAX(AA4:AA34),1,0),2)","v":2},null,null,null,null,null,{"$f":"IF(INT(DateEnreg)>=AG4,IF(DateEnreg<MAX(AG4:AG34),1,0),2)","v":2},null,null,null,null,null,{"$f":"IF(INT(DateEnreg)>=AM4,IF(DateEnreg<MAX(AM4:AM34),1,0),2)","v":2},null,null,null,null,null,{"$f":"IF(INT(DateEnreg)>=AS4,IF(DateEnreg<MAX(AS4:AS34),1,0),2)","v":2},null,null,null,null,null,{"$f":"IF(INT(DateEnreg)>=AY4,IF(DateEnreg<MAX(AY4:AY34),1,0),2)","v":2},null,null,null,null,null,{"$f":"IF(INT(DateEnreg)>=BE4,IF(DateEnreg<MAX(BE4:BE34),1,0),2)","v":2},null,null,null,null,null,{"$f":"IF(INT(DateEnreg)>=BK4,IF(DateEnreg<MAX(BK4:BK34),1,0),2)","v":2},null,null,null,null,null,{"$f":"IF(INT(DateEnreg)>=BQ4,IF(DateEnreg<MAX(BQ4:BQ34),1,0),2)","v":2}]
[1,null,"2015-09-01",{"$f":"INT((C4-(DATE(YEAR(C4-WEEKDAY(C4-1)+4),1,3)-WEEKDAY(DATE(YEAR(C4 -WEEKDAY(C4-1)+4),1,3)))+5)/7)","v":36},null,null,null,null,{"$f":"DATE(YEAR(C4),MONTH(C4)+1,1)","v":"2015-10-01"},{"$f":"INT((I4-(DATE(YEAR(I4-WEEKDAY(I4-1)+4),1,3)-WEEKDAY(DATE(YEAR(I4 -WEEKDAY(I4-1)+4),1,3)))+5)/7)","v":40},null,null,null,null,{"$f":"DATE(YEAR(I4),MONTH(I4)+1,1)","v":"2015-11-01"},{"$f":"INT((O4-(DATE(YEAR(O4-WEEKDAY(O4-1)+4),1,3)-WEEKDAY(DATE(YEAR(O4 -WEEKDAY(O4-1)+4),1,3)))+5)/7)","v":44},null,null,null,null,{"$f":"DATE(YEAR(O4),MONTH(O4)+1,1)","v":"2015-12-01"},{"$f":"INT((U4-(DATE(YEAR(U4-WEEKDAY(U4-1)+4),1,3)-WEEKDAY(DATE(YEAR(U4 -WEEKDAY(U4-1)+4),1,3)))+5)/7)","v":49},null,null,null,null,{"$f":"DATE(YEAR(U4),MONTH(U4)+1,1)","v":"2016-01-01"},{"$f":"INT((AA4-(DATE(YEAR(AA4-WEEKDAY(AA4-1)+4),1,3)-WEEKDAY(DATE(YEAR(AA4 -WEEKDAY(AA4-1)+4),1,3)))+5)/7)","v":53},null,null,null,null,{"$f":"DATE(YEAR(AA4),MONTH(AA4)+1,1)","v":"2016-02-01"},{"$f":"INT((AG4-(DATE(YEAR(AG4-WEEKDAY(AG4-1)+4),1,3)-WEEKDAY(DATE(YEAR(AG4 -WEEKDAY(AG4-1)+4),1,3)))+5)/7)","v":5},null,null,null,null,{"$f":"DATE(YEAR(AG4),MONTH(AG4)+1,1)","v":"2016-03-01"},{"$f":"INT((AM4-(DATE(YEAR(AM4-WEEKDAY(AM4-1)+4),1,3)-WEEKDAY(DATE(YEAR(AM4 -WEEKDAY(AM4-1)+4),1,3)))+5)/7)","v":9},null,null,null,null,{"$f":"DATE(YEAR(AM4),MONTH(AM4)+1,1)","v":"2016-04-01"},{"$f":"INT((AS4-(DATE(YEAR(AS4-WEEKDAY(AS4-1)+4),1,3)-WEEKDAY(DATE(YEAR(AS4 -WEEKDAY(AS4-1)+4),1,3)))+5)/7)","v":13},null,null,null,null,{"$f":"DATE(YEAR(AS4),MONTH(AS4)+1,1)","v":"2016-05-01"},{"$f":"INT((AY4-(DATE(YEAR(AY4-WEEKDAY(AY4-1)+4),1,3)-WEEKDAY(DATE(YEAR(AY4 -WEEKDAY(AY4-1)+4),1,3)))+5)/7)","v":17},null,null,null,null,{"$f":"DATE(YEAR(AY4),MONTH(AY4)+1,1)","v":"2016-06-01"},{"$f":"INT((BE4-(DATE(YEAR(BE4-WEEKDAY(BE4-1)+4),1,3)-WEEKDAY(DATE(YEAR(BE4 -WEEKDAY(BE4-1)+4),1,3)))+5)/7)","v":22},null,null,null,null,{"$f":"DATE(YEAR(BE4),MONTH(BE4)+1,1)","v":"2016-07-01"},{"$f":"INT((BK4-(DATE(YEAR(BK4-WEEKDAY(BK4-1)+4),1,3)-WEEKDAY(DATE(YEAR(BK4 -WEEKDAY(BK4-1)+4),1,3)))+5)/7)","v":26},null,null,null,null,{"$f":"DATE(YEAR(BK4),MONTH(BK4)+1,1)","v":"2016-08-01"},{"$f":"INT((BQ4-(DATE(YEAR(BQ4-WEEKDAY(BQ4-1)+4),1,3)-WEEKDAY(DATE(YEAR(BQ4 -WEEKDAY(BQ4-1)+4),1,3)))+5)/7)","v":31}]
[2,null,{"$f":"DATE(YEAR(C4),MONTH(C4),2)","v":"2015-09-02"},null,null,null,null,null,{"$f":"I4+1","v":"2015-10-02"},null,null,null,null,null,{"$f":"O4+1","v":"2015-11-02"},null,null,null,null,null,{"$f":"U4+1","v":"2015-12-02"},null,null,null,null,null,{"$f":"AA4+1","v":"2016-01-02"},null,null,null,null,null,{"$f":"AG4+1","v":"2016-02-02"},null,null,null,null,null,{"$f":"AM4+1","v":"2016-03-02"},null,null,null,null,null,{"$f":"AS4+1","v":"2016-04-02"},null,null,null,null,null,{"$f":"AY4+1","v":"2016-05-02"},null,null,null,null,null,{"$f":"BE4+1","v":"2016-06-02"},null,null,null,null,null,{"$f":"BK4+1","v":"2016-07-02"},null,null,null,null,null,{"$f":"BQ4+1","v":"2016-08-02"}]
[3,null,{"$f":"C5+1","v":"2015-09-03"},null,null,null,null,null,"2015-10-03",null,null,null,null,null,"2015-11-03",null,null,null,null,null,"2015-12-03",null,null,null,null,null,"2016-01-03",null,null,null,null,null,"2016-02-03",null,null,null,null,null,"2016-03-03",null,null,null,null,null,"2016-04-03",null,null,null,null,null,"2016-05-03",null,null,null,null,null,"2016-06-03",null,null,null,null,null,"2016-07-03",null,null,null,null,null,"2016-08-03"]
[4,null,"2015-09-04",null,null,null,null,null,"2015-10-04",null,null,null,null,null,"2015-11-04",null,null,null,null,null,"2015-12-04",null,null,null,null,null,"2016-01-04",null,null,null,null,null,"2016-02-04",null,null,null,null,null,"2016-03-04",null,null,null,null,null,"2016-04-04",null,null,null,null,null,"2016-05-04",null,null,null,null,null,"2016-06-04",null,null,null,null,null,"2016-07-04",null,null,null,null,null,"2016-08-04"]
[5,null,"2015-09-05",null,null,null,null,null,"2015-10-05",null,null,null,null,null,"2015-11-05",null,null,null,null,null,"2015-12-05",null,null,null,null,null,"2016-01-05",null,null,null,null,null,"2016-02-05",null,null,null,null,null,"2016-03-05",null,null,null,null,null,"2016-04-05",null,null,null,null,null,"2016-05-05",null,null,null,null,null,"2016-06-05",null,null,null,null,null,"2016-07-05",null,null,null,null,null,"2016-08-05"]
[6,null,"2015-09-06",null,null,null,null,null,"2015-10-06",null,null,null,null,null,"2015-11-06",null,null,null,null,null,"2015-12-06",null,null,null,null,null,"2016-01-06",null,null,null,null,null,"2016-02-06",null,null,null,null,null,"2016-03-06",null,null,null,null,null,"2016-04-06",null,null,null,null,null,"2016-05-06",null,null,null,null,null,"2016-06-06",null,null,null,null,null,"2016-07-06",null,null,null,null,null,"2016-08-06"]
[7,null,"2015-09-07",null,null,null,null,null,"2015-10-07",null,null,null,null,null,"2015-11-07",null,null,null,null,null,"2015-12-07",null,null,null,null,null,"2016-01-07",null,null,null,null,null,"2016-02-07",null,null,null,null,null,"2016-03-07",null,null,null,null,null,"2016-04-07",null,null,null,null,null,"2016-05-07",null,null,null,null,null,"2016-06-07",null,null,null,null,null,"2016-07-07",null,null,null,null,null,"2016-08-07"]
[8,null,"2015-09-08",null,null,null,null,null,"2015-10-08",null,null,null,null,null,"2015-11-08",null,null,null,null,null,"2015-12-08",null,null,null,null,null,"2016-01-08",null,null,null,null,null,"2016-02-08",null,null,null,null,null,"2016-03-08",null,null,null,null,null,"2016-04-08",null,null,null,null,null,"2016-05-08",null,null,null,null,null,"2016-06-08",null,null,null,null,null,"2016-07-08",null,null,null,null,null,"2016-08-08"]
[9,null,"2015-09-09",null,null,null,null,null,"2015-10-09",null,null,null,null,null,"2015-11-09",null,null,null,null,null,"2015-12-09",null,null,null,null,null,"2016-01-09",null,null,null,null,null,"2016-02-09",null,null,null,null,null,"2016-03-09",null,null,null,null,null,"2016-04-09",null,null,null,null,null,"2016-05-09",null,null,null,null,null,"2016-06-09",null,null,null,null,null,"2016-07-09",null,null,null,null,null,"2016-08-09"]
[10,null,"2015-09-10",null,null,null,null,null,"2015-10-10",null,null,null,null,null,"2015-11-10",null,null,null,null,null,"2015-12-10",null,null,null,null,null,"2016-01-10",null,null,null,null,null,"2016-02-10",null,null,null,null,null,"2016-03-10",null,null,null,null,null,"2016-04-10",null,null,null,null,null,"2016-05-10",null,null,null,null,null,"2016-06-10",null,null,null,null,null,"2016-07-10",null,null,null,null,null,"2016-08-10"]
[11,null,"2015-09-11",null,null,null,null,null,"2015-10-11",null,null,null,null,null,"2015-11-11",null,null,null,null,null,"2015-12-11",null,null,null,null,null,"2016-01-11",null,null,null,null,null,"2016-02-11",null,null,null,null,null,"2016-03-11",null,null,null,null,null,"2016-04-11",null,null,null,null,null,"2016-05-11",null,null,null,null,null,"2016-06-11",null,null,null,null,null,"2016-07-11",null,null,null,null,null,"2016-08-11"]
[12,null,"2015-09-12",null,null,null,null,null,"2015-10-12",null,null,null,null,null,"2015-11-12",null,null,null,null,null,"2015-12-12",null,null,null,null,null,"2016-01-12",null,null,null,null,null,"2016-02-12",null,null,null,null,null,"2016-03-12",null,null,null,null,null,"2016-04-12",null,null,null,null,null,"2016-05-12",null,null,null,null,null,"2016-06-12",null,null,null,null,null,"2016-07-12",null,null,null,null,null,"2016-08-12"]
[13,null,"2015-09-13",null,null,null,null,null,"2015-10-13",null,null,null,null,null,"2015-11-13",null,null,null,null,null,"2015-12-13",null,null,null,null,null,"2016-01-13",null,null,null,null,null,"2016-02-13",null,null,null,null,null,"2016-03-13",null,null,null,null,null,"2016-04-13",null,null,null,null,null,"2016-05-13",null,null,null,null,null,"2016-06-13",null,null,null,null,null,"2016-07-13",null,null,null,null,null,"2016-08-13"]
[14,null,"2015-09-14",null,null,null,null,null,"2015-10-14",null,null,null,null,null,"2015-11-14",null,null,null,null,null,{"$f":"U16+1","v":"2015-12-14"},null,null,null,null,null,"2016-01-14",null,null,null,null,null,"2016-02-14",null,null,null,null,null,"2016-03-14",null,null,null,null,null,"2016-04-14",null,null,null,null,null,"2016-05-14",null,null,null,null,null,"2016-06-14",null,null,null,null,null,"2016-07-14",null,null,null,null,null,"2016-08-14"]
[15,null,"2015-09-15",null,null,null,null,null,"2015-10-15",null,null,null,null,null,"2015-11-15",null,null,null,null,null,"2015-12-15",null,null,null,null,null,"2016-01-15",null,null,null,null,null,"2016-02-15",null,null,null,null,null,"2016-03-15",null,null,null,null,null,"2016-04-15",null,null,null,null,null,"2016-05-15",null,null,null,null,null,"2016-06-15",null,null,null,null,null,"2016-07-15",null,null,null,null,null,"2016-08-15"]
[16,null,"2015-09-16",null,null,null,null,null,"2015-10-16",null,null,null,null,null,"2015-11-16",null,null,null,null,null,"2015-12-16",null,null,null,null,null,"2016-01-16",null,null,null,null,null,"2016-02-16",null,null,null,null,null,"2016-03-16",null,null,null,null,null,"2016-04-16",null,null,null,null,null,"2016-05-16",null,null,null,null,null,"2016-06-16",null,null,null,null,null,"2016-07-16",null,null,null,null,null,"2016-08-16"]
[17,null,"2015-09-17",null,null,null,null,null,"2015-10-17",null,null,null,null,null,"2015-11-17",null,null,null,null,null,"2015-12-17",null,null,null,null,null,"2016-01-17",null,null,null,null,null,"2016-02-17",null,null,null,null,null,"2016-03-17",null,null,null,null,null,"2016-04-17",null,null,null,null,null,"2016-05-17",null,null,null,null,null,"2016-06-17",null,null,null,null,null,"2016-07-17",null,null,null,null,null,"2016-08-17"]
[18,null,"2015-09-18",null,null,null,null,null,"2015-10-18",null,null,null,null,null,"2015-11-18",null,null,null,null,null,"2015-12-18",null,null,null,null,null,"2016-01-18",null,null,null,null,null,"2016-02-18",null,null,null,null,null,"2016-03-18",null,null,null,null,null,"2016-04-18",null,null,null,null,null,"2016-05-18",null,null,null,null,null,"2016-06-18",null,null,null,null,null,"2016-07-18",null,null,null,null,null,"2016-08-18"]
[19,null,"2015-09-19",null,null,null,null,null,"2015-10-19",null,null,null,null,null,"2015-11-19",null,null,null,null,null,"2015-12-19",null,null,null,null,null,"2016-01-19",null,null,null,null,null,"2016-02-19",null,null,null,null,null,"2016-03-19",null,null,null,null,null,"2016-04-19",null,null,null,null,null,"2016-05-19",null,null,null,null,null,"2016-06-19",null,null,null,null,null,"2016-07-19",null,null,null,null,null,"2016-08-19"]
[20,null,"2015-09-20",null,null,null,null,null,"2015-10-20",null,null,null,null,null,"2015-11-20",null,null,null,null,null,"2015-12-20",null,null,null,null,null,"2016-01-20",null,null,null,null,null,"2016-02-20",null,null,null,null,null,"2016-03-20",null,null,null,null,null,"2016-04-20",null,null,null,null,null,"2016-05-20",null,null,null,null,null,"2016-06-20",null,null,null,null,null,"2016-07-20",null,null,null,null,null,"2016-08-20"]
[21,null,"2015-09-21",null,null,null,null,null,"2015-10-21",null,null,null,null,null,"2015-11-21",null,null,null,null,null,"2015-12-21",null,null,null,null,null,"2016-01-21",null,null,null,null,null,"2016-02-21",null,null,null,null,null,"2016-03-21",null,null,null,null,null,"2016-04-21",null,null,null,null,null,"2016-05-21",null,null,null,null,null,"2016-06-21",null,null,null,null,null,"2016-07-21",null,null,null,null,null,"2016-08-21"]
[22,null,"2015-09-22",null,null,null,null,null,"2015-10-22",null,null,null,null,null,"2015-11-22",null,null,null,null,null,"2015-12-22",null,null,null,null,null,"2016-01-22",null,null,null,null,null,"2016-02-22",null,null,null,null,null,"2016-03-22",null,null,null,null,null,"2016-04-22",null,null,null,null,null,"2016-05-22",null,null,null,null,null,"2016-06-22",null,null,null,null,null,"2016-07-22",null,null,null,null,null,"2016-08-22"]
[23,null,"2015-09-23",null,null,null,null,null,"2015-10-23",null,null,null,null,null,"2015-11-23",null,null,null,null,null,"2015-12-23",null,null,null,null,null,"2016-01-23",null,null,null,null,null,"2016-02-23",null,null,null,null,null,"2016-03-23",null,null,null,null,null,"2016-04-23",null,null,null,null,null,"2016-05-23",null,null,null,null,null,"2016-06-23",null,null,null,null,null,"2016-07-23",null,null,null,null,null,"2016-08-23"]
[24,null,"2015-09-24",null,null,null,null,null,"2015-10-24",null,null,null,null,null,"2015-11-24",null,null,null,null,null,"2015-12-24",null,null,null,null,null,"2016-01-24",null,null,null,null,null,"2016-02-24",null,null,null,null,null,"2016-03-24",null,null,null,null,null,"2016-04-24",null,null,null,null,null,"2016-05-24",null,null,null,null,null,"2016-06-24",null,null,null,null,null,"2016-07-24",null,null,null,null,null,"2016-08-24"]
[25,null,"2015-09-25",null,null,null,null,null,"2015-10-25",null,null,null,null,null,"2015-11-25",null,null,null,null,null,"2015-12-25",null,null,null,null,null,"2016-01-25",null,null,null,null,null,"2016-02-25",null,null,null,null,null,"2016-03-25",null,null,null,null,null,"2016-04-25",null,null,null,null,null,"2016-05-25",null,null,null,null,null,"2016-06-25",null,null,null,null,null,"2016-07-25",null,null,null,null,null,"2016-08-25"]
[26,null,"2015-09-26",null,null,null,null,null,"2015-10-26",null,null,null,null,null,"2015-11-26",null,null,null,null,null,"2015-12-26",null,null,null,null,null,"2016-01-26",null,null,null,null,null,"2016-02-26",null,null,null,null,null,"2016-03-26",null,null,null,null,null,"2016-04-26",null,null,null,null,null,"2016-05-26",null,null,null,null,null,"2016-06-26",null,null,null,null,null,"2016-07-26",null,null,null,null,null,"2016-08-26"]
[27,null,"2015-09-27",null,null,null,null,null,"2015-10-27",null,null,null,null,null,"2015-11-27",null,null,null,null,null,"2015-12-27",null,null,null,null,null,"2016-01-27",null,null,null,null,null,"2016-02-27",null,null,null,null,null,"2016-03-27",null,null,null,null,null,"2016-04-27",null,null,null,null,null,"2016-05-27",null,null,null,null,null,"2016-06-27",null,null,null,null,null,"2016-07-27",null,null,null,null,null,"2016-08-27"]
[28,null,"2015-09-28",null,null,null,null,null,"2015-10-28",null,null,null,null,null,"2015-11-28",null,null,null,null,null,"2015-12-28",null,null,null,null,null,"2016-01-28",null,null,null,null,null,"2016-02-28",null,null,null,null,null,"2016-03-28",null,null,null,null,null,"2016-04-28",null,null,null,null,null,"2016-05-28",null,null,null,null,null,"2016-06-28",null,null,null,null,null,"2016-07-28",null,null,null,null,null,"2016-08-28"]
[29," ",{"$f":"IF(OR(MONTH(C$31)<>MONTH(C$31+1),C$31=59),REPT(\"/\",100),C31+1)","v":"2015-09-29"},null,null,null,null," ",{"$f":"IF(OR(MONTH(I$31)<>MONTH(I$31+1),I$31=59),REPT(\"/\",100),I31+1)","v":"2015-10-29"},null,null,null,null," ",{"$f":"IF(MONTH(O$31)<>MONTH(O$31+1),REPT(\"/\",100),O31+1)","v":"2015-11-29"},null,null,null,null," ",{"$f":"IF(MONTH(U$31)<>MONTH(U$31+1),REPT(\"/\",100),U31+1)","v":"2015-12-29"},null,null,null,null," ",{"$f":"IF(MONTH(AA$31)<>MONTH(AA$31+1),REPT(\"/\",100),AA31+1)","v":"2016-01-29"},null,null,null,null," ",{"$f":"IF(MONTH(AG$31)<>MONTH(AG$31+1),REPT(\"/\",100),AG31+1)","v":"2016-02-29"},null,null,null,null," ",{"$f":"IF(MONTH(AM$31)<>MONTH(AM$31+1),REPT(\"/\",100),AM31+1)","v":"2016-03-29"},null,null,null,null," ",{"$f":"IF(MONTH(AS$31)<>MONTH(AS$31+1),REPT(\"/\",100),AS31+1)","v":"2016-04-29"},null,null,null,null," ",{"$f":"IF(MONTH(AY$31)<>MONTH(AY$31+1),REPT(\"/\",100),AY31+1)","v":"2016-05-29"},null,null,null,null," ",{"$f":"IF(MONTH(BE$31)<>MONTH(BE$31+1),REPT(\"/\",100),BE31+1)","v":"2016-06-29"},null,null,null,null," ",{"$f":"IF(MONTH(BK$31)<>MONTH(BK$31+1),REPT(\"/\",100),BK31+1)","v":"2016-07-29"},null,null,null,null," ",{"$f":"IF(MONTH(BQ$31)<>MONTH(BQ$31+1),REPT(\"/\",100),BQ31+1)","v":"2016-08-29"}]
[30," ",{"$f":"IF(MONTH(C$31)<>MONTH(C$31+2),REPT(\"/\",100),C32+1)","v":"2015-09-30"},null,null,null,null," ",{"$f":"IF(MONTH(I$31)<>MONTH(I$31+2),REPT(\"/\",100),I32+1)","v":"2015-10-30"},null,null,null,null," ",{"$f":"IF(MONTH(O$31)<>MONTH(O$31+2),REPT(\"/\",100),O32+1)","v":"2015-11-30"},null,null,null,null," ",{"$f":"IF(MONTH(U$31)<>MONTH(U$31+2),REPT(\"/\",100),U32+1)","v":"2015-12-30"},null,null,null,null," ",{"$f":"IF(MONTH(AA$31)<>MONTH(AA$31+2),REPT(\"/\",100),AA32+1)","v":"2016-01-30"},null,null,null,null," ",{"$f":"IF(MONTH(AG$31)<>MONTH(AG$31+2),REPT(\"/\",100),AG32+1)","v":"////////////////////////////////////////////////////////////////////////////////////////////////////"},null,null,null,null," ",{"$f":"IF(MONTH(AM$31)<>MONTH(AM$31+2),REPT(\"/\",100),AM32+1)","v":"2016-03-30"},null,null,null,null," ",{"$f":"IF(MONTH(AS$31)<>MONTH(AS$31+2),REPT(\"/\",100),AS32+1)","v":"2016-04-30"},null,null,null,null," ",{"$f":"IF(MONTH(AY$31)<>MONTH(AY$31+2),REPT(\"/\",100),AY32+1)","v":"2016-05-30"},null,null,null,null," ",{"$f":"IF(MONTH(BE$31)<>MONTH(BE$31+2),REPT(\"/\",100),BE32+1)","v":"2016-06-30"},null,null,null,null," ",{"$f":"IF(MONTH(BK$31)<>MONTH(BK$31+2),REPT(\"/\",100),BK32+1)","v":"2016-07-30"},null,null,null,null," ",{"$f":"IF(MONTH(BQ$31)<>MONTH(BQ$31+2),REPT(\"/\",100),BQ32+1)","v":"2016-08-30"}]
[31," ",{"$f":"IF(MONTH(C$31)<>MONTH(C$31+3),REPT(\"/\",100),C33+1)","v":"////////////////////////////////////////////////////////////////////////////////////////////////////"},null,null,null,null," ",{"$f":"IF(MONTH(I$31)<>MONTH(I$31+3),REPT(\"/\",100),I33+1)","v":"2015-10-31"},null,null,null,null," ",{"$f":"IF(MONTH(O$31)<>MONTH(O$31+3),REPT(\"/\",100),O33+1)","v":"////////////////////////////////////////////////////////////////////////////////////////////////////"},null,null,null,null," ",{"$f":"IF(MONTH(U$31)<>MONTH(U$31+3),REPT(\"/\",100),U33+1)","v":"2015-12-31"},null,null,null,null," ",{"$f":"IF(MONTH(AA$31)<>MONTH(AA$31+3),REPT(\"/\",100),AA33+1)","v":"2016-01-31"},null,null,null,null," ",{"$f":"IF(MONTH(AG$31)<>MONTH(AG$31+3),REPT(\"/\",100),AG33+1)","v":"////////////////////////////////////////////////////////////////////////////////////////////////////"},null,null,null,null," ",{"$f":"IF(MONTH(AM$31)<>MONTH(AM$31+3),REPT(\"/\",100),AM33+1)","v":"2016-03-31"},null,null,null,null," ",{"$f":"IF(MONTH(AS$31)<>MONTH(AS$31+3),REPT(\"/\",100),AS33+1)","v":"////////////////////////////////////////////////////////////////////////////////////////////////////"},null,null,null,null," ",{"$f":"IF(MONTH(AY$31)<>MONTH(AY$31+3),REPT(\"/\",100),AY33+1)","v":"2016-05-31"},null,null,null,null," ",{"$f":"IF(MONTH(BE$31)<>MONTH(BE$31+3),REPT(\"/\",100),BE33+1)","v":"////////////////////////////////////////////////////////////////////////////////////////////////////"},null,null,null,null," ",{"$f":"IF(MONTH(BK$31)<>MONTH(BK$31+3),REPT(\"/\",100),BK33+1)","v":"2016-07-31"},null,null,null,null," ",{"$f":"IF(MONTH(BQ$31)<>MONTH(BQ$31+3),REPT(\"/\",100),BQ33+1)","v":"2016-08-31"}]
[null,null," "," ",null,null," ",null,"2013-02-16T18:03:00",null,null,null,null,null," ","->",null,null,{"$f":"IF(YEAR(DateInitiale)=YEAR(MAX(2:2)),TEXT(C2,\"aaaa\"),TEXT(DateInitiale,\"mmm aaaa - \")&TEXT(MAX(2:2),\"mmm aaaa\"))","v":"sept 2015 - août 2016"},null," "," ",null,null,null,null,{"$f":"'vacances scolaires'!B10","v":1610516}," ",null,null,null,null,null," ",null,null,null,null," "," ",null,null,null,null," "," ",null,null," ",null," "," ",null,null," ",null," "," ",null,null," ",null," "," ",null,null," ",null,null,null,null,null,"http://www.doublevez.com"]
[null,null,null,null,null,null,null,null,{"$f":"CELL(\"filename\",A1)","v":"C:\\USERs\\joas5615\\documents\\jms\\_sitesWeb\\_www\\excel\\calendrier\\[calendrier_automatique.xlsb]Planning"}]
[null,null,null,null,null,null,null,null,"                                                   ",null,null,null,null,null,"                                                   ",null,null,null,null,null,"                                                   ",null,null,null,null,null,null,null,null,null,null,null,null,null,null,null,null,null,"                                                   ",null,null,null,null,null,"                                                   ",null,null,null,null,null,"                                                   ",null,null,null,null,null,"                                                   ",null,null,null,null,null,"                                                   ",null,null,null,null,null,"                                                   "]

{"sheet":"mode d'emploi","index":1,"n_rows":31,"n_cols":15,"rows_kept":31,"cut":false,"hidden":false,"merged":[[24,1,24,3],[9,12,10,14],[4,8,5,12],[2,8,2,13],[8,8,8,10],[8,12,8,14]]}
[null,null,"avant tout, il faut regarder la vidéo ->"]
[null,null,null,null,null,null,null,null,"2005-03-01"]
[null,"\n\nbienvenue dans l'espace aide de cette petite application !",null,null,null,null,null,null,"site du téléchargement de la dernière version"]
[]
[null,null,null,null,null,null,null,"     ","écrire à l'auteur ?"]
[]
[]
[null,null,null,null,null,null,null,null,"exemple de deux deux dispositions possibles"]
[null,null,null,null,null,null,null,null,"exemple 1",null,null,null,"exemple 2 "]
[null,null,null,null,null,null,null,null,null,null,null,null,"attention  : ne pas copier une case matin sur une case après-midi"]
[]
[]
[null,null,null,null,null,null,null,null,{"$f":"I15","v":"2011-07-01"},null,null,null,{"$f":"M15","v":"2011-07-01"}]
[null,null,null,null,null,null,null,null,null,null,null,null,"jour","matin","après-midi"]
[null,"S'améliorer sur Excel de Microsoft ? -->",null,"cours excel de JMS",null,null,null,null,"2011-07-01",null,"exemple de données présentes",null,{"$f":"I15","v":"2011-07-01"},"ne pas oublier la procédure début de mois…"]
[null,null,null,null,null,null,null,null,{"$f":"I15+1","v":"2011-07-02"},null,"journée chargée !",null,{"$f":"M15+1","v":"2011-07-02"},"RL"]
[null,null,null,null,null,null,null,null,"2011-07-03",null,null,null,"2011-07-03","JMS"]
[null,null,null,null,null,null,null,null,"2011-07-04",null,"idem",null,"2011-07-04",null,"?"]
[null,null,null,null,null,null,null,null,"2011-07-05",null,null,null,"2011-07-05"]
[null,null,null,null,null,null,null,null,"2011-07-06",null,null,null,"2011-07-06"]
[null,null,null,null,null,null,null,null,"2011-07-07",null,"plus cool…",null,"2011-07-07",null,"à prévoir…"]
[null,null,null,null,null,null,null,null,"2011-07-08",null,"important :consuler le site http://doublevez.com",null,"2011-07-08","RL","JMS"]
[null,null,null,null,null,null,null,null,"etc…",null,null,null,"etc…"]
[null,null,"à lire, sur les calendriers :"]
[]
[]
[]
[]
[]
[]
[null,"2011-01-01"]

{"sheet":"paramètres","index":2,"n_rows":38,"n_cols":16,"rows_kept":38,"cut":false,"hidden":false,"merged":[[16,1,16,5],[22,1,22,2],[30,1,30,5],[23,3,23,6],[20,1,20,3],[19,1,19,3]]}
[null,null,null,null,"vb_lf",{"$f":"CHAR(10)","v":"\n"},null,null,null,null,null,null,null,"exemple","jour ouvrables (5/7)\n(samedi et Dimanches non ouvrables)","jour ouvrables (6/7) \n(seuls les dimanches ne sont pas ouvrables)"]
[null,null,null,null,null,null,null,null,null,null,null,null,null,"2006-12-15",{"$f":"EstOuvrable(N2)","v":1},{"$f":"EstOuvrableAvecSamedis(N2)","v":1}]
[null,null,null,null,null,null,null,null,null,null,null,null,null,{"$f":"N2+1","v":"2006-12-16"},0,1]
[null,"mode initial",null,{"$f":"IF(mode_initial<>12,\"réinitialisation ?\",\"\")","v":"réinitialisation ?"},null,null,null,null,null,null,null,null,null,"2006-12-17",0,0]
[null,"fête nationale",null,{"$f":"fete_nat","v":"2015-07-14"},{"$f":"MONTH(D5)","v":7},{"$f":"DAY(D5)","v":14},null,null,null,null,null,null,null,"2006-12-18",1,1]
[null,"Alsace ou normal ?",false,{"$f":"IF(mode_Alsace=0,\"Alsace = non\",\"Alsace = OUI\")","v":"Alsace = OUI"},null,null,null,null,null,null,null,null,null,"2006-12-19",1,1]
[null,"samedi ouvrable ?",false,{"$f":"IF(samedi_ouvrable,\"samedis ouvrables=OUI\",\"samedis ouvrables=non\")","v":"samedis ouvrables=non"},null,null,null,null,null,null,null,null,null,"2006-12-20",1,1]
[null,"sans fond ?",false,{"$f":"IF(NOT(sans_fond),\"couleur de fond = oui\",\"couleur de fond=NON\")","v":"couleur de fond = oui"},null,null,null,null,null,null,null,null,null,"2006-12-21",1,1]
[null,"sans lundi de Pentecôte ?",false,{"$f":"IF(NOT(sans_pentecote),\"lundi de Pentecôte = oui\",\"lundi de Pentecôte=NON\")","v":"lundi de Pentecôte = oui"},null,null,null,null,null,null,null,null,null,"2006-12-22",1,1]
[null,"num colonnes / lignes = ",1,{"$f":"B10&IF(mode_entêtes, \"oui\",\"NON\")","v":"num colonnes / lignes = oui"},null,null,null,null,null,null,null,null,null,"2006-12-23",0,1]
[null,"Pays",1,null,null,null,null,null,null,null,null,null,null,"2006-12-24",0,0]
[null,"France",{"$f":"pays=1","v":true},1,{"$f":"DATE(annee_1,7,14)","v":"2015-07-14"},null,null,null,null,null,null,null,null,"2006-12-25",0,0]
[null,"Luxembourg",{"$f":"pays=2","v":false},2,{"$f":"DATE(annee_1,6,23)","v":"2015-06-23"},null,null,null,null,null,null,null,null,"2006-12-26",1,1]
[null,"Belgique",{"$f":"pays=3","v":false},3,{"$f":"DATE(annee_1,7,21)","v":"2015-07-21"},null,null,null,null,null,null,null,null,"2006-12-27",1,1]
[null,"Suisse",{"$f":"pays=4","v":false},4,{"$f":"DATE(annee_1,8,1)","v":"2015-08-01"},null,null,null,null,null,null,null,null,"2006-12-28",1,1]
[null,null,null,5,null,null,null,null,null,null,null,null,null,"2006-12-29",1,1]
[null,"C:\\USERs\\joas5615\\documents\\jms\\_sitesWeb\\_www\\excel\\calendrier\\calendrier_automatique.xlsb"]
[]
[]
[null,27]
[null,"2015-08-29T14:43:31"]
[]
[null,{"$f":"paques(YEAR(TODAY()))","v":"2015-04-05"},null,{"$f":"IF(ISERR(B23),texte_macros,\"\")","v":""}]
[null,null,null,"attention les macros sont pratiquement indispensables !! \npour activer les macros : au menu Excel 2003,\nOutils>Macros>Sécurité>sécurité moyen et réouvrez le fichier.\nPour Excel 2007, c'est plus simple : option > activer le contenu\ncliquez ici pour avoir plus de détails, \nsinon supprimez ce commentaire par \nun [bouton-droit-souris] bien ajusté..."]
[null,null,null,{"$f":"LEN(texte_macros)","v":347}]
[]
[]
[]
[]
[]
[null,"E:\\doublevez.com\\excel\\calendrier\\calendrier_automatique.xls"]
[]
[]
[null,"suggestions de...","date de l'idée","prochaines versions"]
[null,null,"2012-04-10","le choix de la fête nationale (pour mes amis Belges, Luxembourgeois, etc...)"]
[null,"Vincent F.","2012-05-01","avoir un bouton pour choisir une colonne matin et une colonne après-midi"]
[null,null,"2012-05-01","un bouton rallonger le nombre de mois (en copiant un mois type à part)"]
[null,null,"2012-03-10","avec les vacances scolaires..."]

{"sheet":"jours fériés","index":3,"n_rows":224,"n_cols":20,"rows_kept":224,"cut":false,"hidden":false,"merged":[]}
[null,"1er janvier","vendredi saint","Pâques","Lundi de Pâques","1er mai",{"$f":"VALUE(IF(mode_France,\"8/5\",0))","v":"2015-05-08"},"ascension","Pentecôte","Lundi de pentecote",{"$f":"VALUE(VLOOKUP(pays,fêtes_nat,2,0))","v":"2015-07-14"},"15 août","1er novembre (toussaint)",{"$f":"VALUE(IF(OR(mode_France,mode_Belgique),\"11/11\",0))","v":"2015-11-11"},"noël",{"$f":"VALUE(IF(OR(mode_luxembourg,AND(flag_alsace,mode_France)),\"26/12\",0))","v":"00:00:00"},"annee_1",{"$f":"YEAR(premier_jour)","v":2015},0,"Pâques"]
[{"$f":"IF(sans_fériés,0,2000)","v":2000},{"$f":"DATE(A2,1,1)","v":"2000-01-01"},{"$f":"IF(AND(mode_Alsace,mode_France),D2-2,0)","v":"00:00:00"},{"$f":"VLOOKUP(A2,table_Paques,2,0)","v":"2000-04-23"},{"$f":"D2+1","v":"2000-04-24"},{"$f":"DATE(A2,5,1)","v":"2000-05-01"},{"$f":"IF(G$1,DATE($A2,MONTH(G$1),DAY(G$1)),0)","v":"2000-05-08"},{"$f":"E2+38","v":"2000-06-01"},{"$f":"(D2+49)","v":"2000-06-11"},{"$f":"(I2+1)*NOT(sans_pentecote)","v":"2000-06-12"},{"$f":"DATE($A2,MONTH(fete_nat),DAY(fete_nat))","v":"2000-07-14"},{"$f":"DATE($A2,8,15)","v":"2000-08-15"},{"$f":"DATE($A2,11,1)","v":"2000-11-01"},{"$f":"IF(N$1,DATE($A2,MONTH(N$1),DAY(N$1)),0)","v":"2000-11-11"},{"$f":"DATE($A2,12,25)","v":"2000-12-25"},{"$f":"IF(P$1,DATE($A2,MONTH(P$1),DAY(P$1)),0)","v":"00:00:00"},"annee_z",{"$f":"YEAR(MAX(derniers_jours))","v":2016},1900,"1900-04-15"]
[{"$f":"IF(sans_fériés,0,A2+1)","v":2001},{"$f":"DATE(A3,1,1)","v":"2001-01-01"},"00:00:00","2001-04-15",{"$f":"D3+1","v":"2001-04-16"},{"$f":"DATE(A3,5,1)","v":"2001-05-01"},{"$f":"IF(G$1,DATE($A3,MONTH(G$1),DAY(G$1)),0)","v":"2001-05-08"},{"$f":"E3+38","v":"2001-05-24"},{"$f":"(D3+49)","v":"2001-06-03"},"2001-06-04","2001-07-14",{"$f":"DATE($A3,8,15)","v":"2001-08-15"},{"$f":"DATE($A3,11,1)","v":"2001-11-01"},{"$f":"IF(N$1,DATE($A3,MONTH(N$1),DAY(N$1)),0)","v":"2001-11-11"},{"$f":"DATE($A3,12,25)","v":"2001-12-25"},{"$f":"IF(P$1,DATE($A3,MONTH(P$1),DAY(P$1)),0)","v":"00:00:00"},"décalage pour l'année 1",{"$f":"MATCH(annee_1,années_fériés,0)-2","v":15},1901,"1901-04-07"]
[2002,"2002-01-01","00:00:00","2002-03-31","2002-04-01","2002-05-01","2002-05-08","2002-05-09","2002-05-19","2002-05-20","2002-07-14","2002-08-15","2002-11-01","2002-11-11","2002-12-25","00:00:00","nb_fériés",{"$f":"COLUMN(P4)-COLUMN(A4)","v":15},1902,"1902-03-30"]
[2003,"2003-01-01","00:00:00","2003-04-20","2003-04-21","2003-05-01","2003-05-08","2003-05-29","2003-06-08","2003-06-09","2003-07-14","2003-08-15","2003-11-01","2003-11-11","2003-12-25","00:00:00","formule nom fériés",{"$f":"OFFSET(start_fériés,position_année,0,annee_z-annee_1+1,nb_fériés)","v":{"$error":"#VALUE!"}},1903,"1903-04-12"]
[2004,"2004-01-01","00:00:00","2004-04-11","2004-04-12","2004-05-01","2004-05-08","2004-05-20","2004-05-30","2004-05-31","2004-07-14","2004-08-15","2004-11-01","2004-11-11","2004-12-25","00:00:00","sans fériés",false,1904,"1904-04-03"]
[2005,"2005-01-01","00:00:00","2005-03-27","2005-03-28","2005-05-01","2005-05-08","2005-05-05","2005-05-15","2005-05-16","2005-07-14","2005-08-15","2005-11-01","2005-11-11","2005-12-25","00:00:00",null,null,1905,"1905-04-23"]
[2006,"2006-01-01","00:00:00","2006-04-16","2006-04-17","2006-05-01","2006-05-08","2006-05-25","2006-06-04","2006-06-05","2006-07-14","2006-08-15","2006-11-01","2006-11-11","2006-12-25","00:00:00",null,null,1906,"1906-04-15"]
[2007,"2007-01-01","00:00:00","2007-04-08","2007-04-09","2007-05-01","2007-05-08","2007-05-17","2007-05-27","2007-05-28","2007-07-14","2007-08-15","2007-11-01","2007-11-11","2007-12-25","00:00:00",null,null,1907,"1907-03-31"]
[2008,"2008-01-01","00:00:00","2008-03-23","2008-03-24","2008-05-01","2008-05-08","2008-05-01","2008-05-11","2008-05-12","2008-07-14","2008-08-15","2008-11-01","2008-11-11","2008-12-25","00:00:00",null,null,1908,"1908-04-19"]
[2009,"2009-01-01","00:00:00","2009-04-12","2009-04-13","2009-05-01","2009-05-08","2009-05-21","2009-05-31","2009-06-01","2009-07-14","2009-08-15","2009-11-01","2009-11-11","2009-12-25","00:00:00",null,null,1909,"1909-04-11"]
[2010,"2010-01-01","00:00:00","2010-04-04","2010-04-05","2010-05-01","2010-05-08","2010-05-13","2010-05-23","2010-05-24","2010-07-14","2010-08-15","2010-11-01","2010-11-11","2010-12-25","00:00:00",null,null,1910,"1910-03-27"]
[2011,"2011-01-01","00:00:00","2011-04-24","2011-04-25","2011-05-01","2011-05-08","2011-06-02","2011-06-12","2011-06-13","2011-07-14","2011-08-15","2011-11-01","2011-11-11","2011-12-25","00:00:00",null,null,1911,"1911-04-16"]
[2012,"2012-01-01","00:00:00","2012-04-08","2012-04-09","2012-05-01","2012-05-08","2012-05-17","2012-05-27","2012-05-28","2012-07-14","2012-08-15","2012-11-01","2012-11-11","2012-12-25","00:00:00",null,null,1912,"1912-04-07"]
[2013,"2013-01-01","00:00:00","2013-03-31","2013-04-01","2013-05-01","2013-05-08","2013-05-09","2013-05-19","2013-05-20","2013-07-14","2013-08-15","2013-11-01","2013-11-11","2013-12-25","00:00:00",null,null,1913,"1913-03-23"]
[2014,"2014-01-01","00:00:00","2014-04-20","2014-04-21","2014-05-01","2014-05-08","2014-05-29","2014-06-08","2014-06-09","2014-07-14","2014-08-15","2014-11-01","2014-11-11","2014-12-25","00:00:00",null,null,1914,"1914-04-12"]
[2015,"2015-01-01","00:00:00","2015-04-05","2015-04-06","2015-05-01","2015-05-08","2015-05-14","2015-05-24","2015-05-25","2015-07-14","2015-08-15","2015-11-01","2015-11-11","2015-12-25","00:00:00",null,null,1915,"1915-04-04"]
[2016,"2016-01-01","00:00:00","2016-03-27","2016-03-28","2016-05-01","2016-05-08","2016-05-05","2016-05-15","2016-05-16","2016-07-14","2016-08-15","2016-11-01","2016-11-11","2016-12-25","00:00:00",null,null,1916,"1916-04-23"]
[2017,"2017-01-01","00:00:00","2017-04-16","2017-04-17","2017-05-01","2017-05-08","2017-05-25","2017-06-04","2017-06-05","2017-07-14","2017-08-15","2017-11-01","2017-11-11","2017-12-25","00:00:00",null,null,1917,"1917-04-08"]
[2018,"2018-01-01","00:00:00","2018-04-01","2018-04-02","2018-05-01","2018-05-08","2018-05-10","2018-05-20","2018-05-21","2018-07-14","2018-08-15","2018-11-01","2018-11-11","2018-12-25","00:00:00",null,null,1918,"1918-03-31"]
[2019,"2019-01-01","00:00:00","2019-04-21","2019-04-22","2019-05-01","2019-05-08","2019-05-30","2019-06-09","2019-06-10","2019-07-14","2019-08-15","2019-11-01","2019-11-11","2019-12-25","00:00:00",null,null,1919,"1919-04-20"]
[2020,"2020-01-01","00:00:00","2020-04-12","2020-04-13","2020-05-01","2020-05-08","2020-05-21","2020-05-31","2020-06-01","2020-07-14","2020-08-15","2020-11-01","2020-11-11","2020-12-25","00:00:00",null,null,1920,"1920-04-04"]
[2021,"2021-01-01","00:00:00","2021-04-04","2021-04-05","2021-05-01","2021-05-08","2021-05-13","2021-05-23","2021-05-24","2021-07-14","2021-08-15","2021-11-01","2021-11-11","2021-12-25","00:00:00",null,null,1921,"1921-03-27"]
[2022,"2022-01-01","00:00:00","2022-04-17","2022-04-18","2022-05-01","2022-05-08","2022-05-26","2022-06-05","2022-06-06","2022-07-14","2022-08-15","2022-11-01","2022-11-11","2022-12-25","00:00:00",null,null,1922,"1922-04-16"]
[2023,"2023-01-01","00:00:00","2023-04-09","2023-04-10","2023-05-01","2023-05-08","2023-05-18","2023-05-28","2023-05-29","2023-07-14","2023-08-15","2023-11-01","2023-11-11","2023-12-25","00:00:00",null,null,1923,"1923-04-01"]
[2024,"2024-01-01","00:00:00","2024-03-31","2024-04-01","2024-05-01","2024-05-08","2024-05-09","2024-05-19","2024-05-20","2024-07-14","2024-08-15","2024-11-01","2024-11-11","2024-12-25","00:00:00",null,null,1924,"1924-04-20"]
[2025,"2025-01-01","00:00:00","2025-04-20","2025-04-21","2025-05-01","2025-05-08","2025-05-29","2025-06-08","2025-06-09","2025-07-14","2025-08-15","2025-11-01","2025-11-11","2025-12-25","00:00:00",null,null,1925,"1925-04-12"]
[2026,"2026-01-01","00:00:00","2026-04-05","2026-04-06","2026-05-01","2026-05-08","2026-05-14","2026-05-24","2026-05-25","2026-07-14","2026-08-15","2026-11-01","2026-11-11","2026-12-25","00:00:00",null,null,1926,"1926-04-04"]
[2027,"2027-01-01","00:00:00","2027-03-28","2027-03-29","2027-05-01","2027-05-08","2027-05-06","2027-05-16","2027-05-17","2027-07-14","2027-08-15","2027-11-01","2027-11-11","2027-12-25","00:00:00",null,null,1927,"1927-04-17"]
[2028,"2028-01-01","00:00:00","2028-04-16","2028-04-17","2028-05-01","2028-05-08","2028-05-25","2028-06-04","2028-06-05","2028-07-14","2028-08-15","2028-11-01","2028-11-11","2028-12-25","00:00:00",null,null,1928,"1928-04-08"]
[2029,"2029-01-01","00:00:00","2029-04-01","2029-04-02","2029-05-01","2029-05-08","2029-05-10","2029-05-20","2029-05-21","2029-07-14","2029-08-15","2029-11-01","2029-11-11","2029-12-25","00:00:00",null,null,1929,"1929-03-31"]
[2030,"2030-01-01","00:00:00","2030-04-21","2030-04-22","2030-05-01","2030-05-08","2030-05-30","2030-06-09","2030-06-10","2030-07-14","2030-08-15","2030-11-01","2030-11-11","2030-12-25","00:00:00",null,null,1930,"1930-04-20"]
[2031,"2031-01-01","00:00:00","2031-04-13","2031-04-14","2031-05-01","2031-05-08","2031-05-22","2031-06-01","2031-06-02","2031-07-14","2031-08-15","2031-11-01","2031-11-11","2031-12-25","00:00:00",null,null,1931,"1931-04-05"]
[2032,"2032-01-01",{"$f":"IF(AND(mode_Alsace,mode_France),D34-2,0)","v":"00:00:00"},{"$f":"VLOOKUP(A34,table_Paques,2,0)","v":"2032-03-28"},"2032-03-29","2032-05-01","2032-05-08","2032-05-06","2032-05-16","2032-05-17",{"$f":"DATE($A34,MONTH(fete_nat),DAY(fete_nat))","v":"2032-07-14"},"2032-08-15","2032-11-01","2032-11-11","2032-12-25","00:00:00",null,null,1932,"1932-03-27"]
[2033,"2033-01-01","00:00:00","2033-04-17","2033-04-18","2033-05-01","2033-05-08","2033-05-26","2033-06-05","2033-06-06","2033-07-14","2033-08-15","2033-11-01","2033-11-11","2033-12-25","00:00:00",null,null,1933,"1933-04-16"]
[2034,"2034-01-01","00:00:00","2034-04-09","2034-04-10","2034-05-01","2034-05-08","2034-05-18","2034-05-28","2034-05-29","2034-07-14","2034-08-15","2034-11-01","2034-11-11","2034-12-25","00:00:00",null,null,1934,"1934-04-01"]
[2035,"2035-01-01","00:00:00","2035-03-25","2035-03-26","2035-05-01","2035-05-08","2035-05-03","2035-05-13","2035-05-14","2035-07-14","2035-08-15","2035-11-01","2035-11-11","2035-12-25","00:00:00",null,null,1935,"1935-04-21"]
[2036,"2036-01-01","00:00:00","2036-04-13","2036-04-14","2036-05-01","2036-05-08","2036-05-22","2036-06-01","2036-06-02","2036-07-14","2036-08-15","2036-11-01","2036-11-11","2036-12-25","00:00:00",null,null,1936,"1936-04-12"]
[2037,"2037-01-01","00:00:00","2037-04-05","2037-04-06","2037-05-01","2037-05-08","2037-05-14","2037-05-24","2037-05-25","2037-07-14","2037-08-15","2037-11-01","2037-11-11","2037-12-25","00:00:00",null,null,1937,"1937-03-28"]
[2038,"2038-01-01","00:00:00","2038-04-25","2038-04-26","2038-05-01","2038-05-08","2038-06-03","2038-06-13","2038-06-14","2038-07-14","2038-08-15","2038-11-01","2038-11-11","2038-12-25","00:00:00",null,null,1938,"1938-04-17"]
[2039,"2039-01-01","00:00:00","2039-04-10","2039-04-11","2039-05-01","2039-05-08","2039-05-19","2039-05-29","2039-05-30","2039-07-14","2039-08-15","2039-11-01","2039-11-11","2039-12-25","00:00:00",null,null,1939,"1939-04-09"]
[2040,"2040-01-01","00:00:00","2040-04-01","2040-04-02","2040-05-01","2040-05-08","2040-05-10","2040-05-20","2040-05-21","2040-07-14","2040-08-15","2040-11-01","2040-11-11","2040-12-25","00:00:00",null,null,1940,"1940-03-24"]
[2041,"2041-01-01","00:00:00","2041-04-21","2041-04-22","2041-05-01","2041-05-08","2041-05-30","2041-06-09","2041-06-10","2041-07-14","2041-08-15","2041-11-01","2041-11-11","2041-12-25","00:00:00",null,null,1941,"1941-04-13"]
[2042,"2042-01-01","00:00:00","2042-04-06","2042-04-07","2042-05-01","2042-05-08","2042-05-15","2042-05-25","2042-05-26","2042-07-14","2042-08-15","2042-11-01","2042-11-11","2042-12-25","00:00:00",null,null,1942,"1942-04-05"]
[2043,"2043-01-01","00:00:00","2043-03-29","2043-03-30","2043-05-01","2043-05-08","2043-05-07","2043-05-17","2043-05-18","2043-07-14","2043-08-15","2043-11-01","2043-11-11","2043-12-25","00:00:00",null,null,1943,"1943-04-25"]
[2044,"2044-01-01","00:00:00","2044-04-17","2044-04-18","2044-05-01","2044-05-08","2044-05-26","2044-06-05","2044-06-06","2044-07-14","2044-08-15","2044-11-01","2044-11-11","2044-12-25","00:00:00",null,null,1944,"1944-04-09"]
[2045,"2045-01-01","00:00:00","2045-04-09","2045-04-10","2045-05-01","2045-05-08","2045-05-18","2045-05-28","2045-05-29","2045-07-14","2045-08-15","2045-11-01","2045-11-11","2045-12-25","00:00:00",null,null,1945,"1945-04-01"]
[2046,"2046-01-01","00:00:00","2046-03-25","2046-03-26","2046-05-01","2046-05-08","2046-05-03","2046-05-13","2046-05-14","2046-07-14","2046-08-15","2046-11-01","2046-11-11","2046-12-25","00:00:00",null,null,1946,"1946-04-21"]
[2047,"2047-01-01","00:00:00","2047-04-14","2047-04-15","2047-05-01","2047-05-08","2047-05-23","2047-06-02","2047-06-03","2047-07-14","2047-08-15","2047-11-01","2047-11-11","2047-12-25","00:00:00",null,null,1947,"1947-04-06"]
[2048,"2048-01-01","00:00:00","2048-04-05","2048-04-06","2048-05-01","2048-05-08","2048-05-14","2048-05-24","2048-05-25","2048-07-14","2048-08-15","2048-11-01","2048-11-11","2048-12-25","00:00:00",null,null,1948,"1948-03-28"]
[2049,"2049-01-01","00:00:00","2049-04-18","2049-04-19","2049-05-01","2049-05-08","2049-05-27","2049-06-06","2049-06-07","2049-07-14","2049-08-15","2049-11-01","2049-11-11","2049-12-25","00:00:00",null,null,1949,"1949-04-17"]
[2050,"2050-01-01","00:00:00","2050-04-10","2050-04-11","2050-05-01","2050-05-08","2050-05-19","2050-05-29","2050-05-30","2050-07-14","2050-08-15","2050-11-01","2050-11-11","2050-12-25","00:00:00",null,null,1950,"1950-04-09"]
[2051,"2051-01-01","00:00:00","2051-04-02","2051-04-03","2051-05-01","2051-05-08","2051-05-11","2051-05-21","2051-05-22","2051-07-14","2051-08-15","2051-11-01","2051-11-11","2051-12-25","00:00:00",null,null,1951,"1951-03-25"]
[2052,"2052-01-01","00:00:00","2052-04-21","2052-04-22","2052-05-01","2052-05-08","2052-05-30","2052-06-09","2052-06-10","2052-07-14","2052-08-15","2052-11-01","2052-11-11","2052-12-25","00:00:00",null,null,1952,"1952-04-13"]
[2053,"2053-01-01","00:00:00","2053-04-06","2053-04-07","2053-05-01","2053-05-08","2053-05-15","2053-05-25","2053-05-26","2053-07-14","2053-08-15","2053-11-01","2053-11-11","2053-12-25","00:00:00",null,null,1953,"1953-04-05"]
[2054,"2054-01-01","00:00:00","2054-03-29","2054-03-30","2054-05-01","2054-05-08","2054-05-07","2054-05-17","2054-05-18","2054-07-14","2054-08-15","2054-11-01","2054-11-11","2054-12-25","00:00:00",null,null,1954,"1954-04-18"]
[2055,"2055-01-01","00:00:00","2055-04-18","2055-04-19","2055-05-01","2055-05-08","2055-05-27","2055-06-06","2055-06-07","2055-07-14","2055-08-15","2055-11-01","2055-11-11","2055-12-25","00:00:00",null,null,1955,"1955-04-10"]
[2056,"2056-01-01","00:00:00","2056-04-02","2056-04-03","2056-05-01","2056-05-08","2056-05-11","2056-05-21","2056-05-22","2056-07-14","2056-08-15","2056-11-01","2056-11-11","2056-12-25","00:00:00",null,null,1956,"1956-04-01"]
[2057,"2057-01-01","00:00:00","2057-04-22","2057-04-23","2057-05-01","2057-05-08","2057-05-31","2057-06-10","2057-06-11","2057-07-14","2057-08-15","2057-11-01","2057-11-11","2057-12-25","00:00:00",null,null,1957,"1957-04-21"]
[2058,"2058-01-01","00:00:00","2058-04-14","2058-04-15","2058-05-01","2058-05-08","2058-05-23","2058-06-02","2058-06-03","2058-07-14","2058-08-15","2058-11-01","2058-11-11","2058-12-25","00:00:00",null,null,1958,"1958-04-06"]
[2059,"2059-01-01","00:00:00","2059-03-30","2059-03-31","2059-05-01","2059-05-08","2059-05-08","2059-05-18","2059-05-19","2059-07-14","2059-08-15","2059-11-01","2059-11-11","2059-12-25","00:00:00",null,null,1959,"1959-03-29"]
[2060,"2060-01-01","00:00:00","2060-04-18","2060-04-19","2060-05-01","2060-05-08","2060-05-27","2060-06-06","2060-06-07","2060-07-14","2060-08-15","2060-11-01","2060-11-11","2060-12-25","00:00:00",null,null,1960,"1960-04-17"]
[2061,"2061-01-01","00:00:00","2061-04-10","2061-04-11","2061-05-01","2061-05-08","2061-05-19","2061-05-29","2061-05-30","2061-07-14","2061-08-15","2061-11-01","2061-11-11","2061-12-25","00:00:00",null,null,1961,"1961-04-02"]
[2062,"2062-01-01","00:00:00","2062-03-26","2062-03-27","2062-05-01","2062-05-08","2062-05-04","2062-05-14","2062-05-15","2062-07-14","2062-08-15","2062-11-01","2062-11-11","2062-12-25","00:00:00",null,null,1962,"1962-04-22"]
[2063,"2063-01-01","00:00:00","2063-04-15","2063-04-16","2063-05-01","2063-05-08","2063-05-24","2063-06-03","2063-06-04","2063-07-14","2063-08-15","2063-11-01","2063-11-11","2063-12-25","00:00:00",null,null,1963,"1963-04-14"]
[2064,"2064-01-01",{"$f":"IF(AND(mode_Alsace,mode_France),D66-2,0)","v":"00:00:00"},{"$f":"VLOOKUP(A66,table_Paques,2,0)","v":"2064-04-06"},"2064-04-07","2064-05-01","2064-05-08","2064-05-15","2064-05-25",{"$f":"(I66+1)*NOT(sans_pentecote)","v":"2064-05-26"},{"$f":"DATE($A66,MONTH(fete_nat),DAY(fete_nat))","v":"2064-07-14"},"2064-08-15","2064-11-01","2064-11-11","2064-12-25","00:00:00",null,null,1964,"1964-03-29"]
[{"$f":"IF(sans_fériés,0,A66+1)","v":2065},{"$f":"DATE(A67,1,1)","v":"2065-01-01"},"00:00:00","2065-03-29",{"$f":"D67+1","v":"2065-03-30"},{"$f":"DATE(A67,5,1)","v":"2065-05-01"},{"$f":"IF(G$1,DATE($A67,MONTH(G$1),DAY(G$1)),0)","v":"2065-05-08"},{"$f":"E67+38","v":"2065-05-07"},{"$f":"(D67+49)","v":"2065-05-17"},"2065-05-18","2065-07-14",{"$f":"DATE($A67,8,15)","v":"2065-08-15"},{"$f":"DATE($A67,11,1)","v":"2065-11-01"},{"$f":"IF(N$1,DATE($A67,MONTH(N$1),DAY(N$1)),0)","v":"2065-11-11"},{"$f":"DATE($A67,12,25)","v":"2065-12-25"},{"$f":"IF(P$1,DATE($A67,MONTH(P$1),DAY(P$1)),0)","v":"00:00:00"},null,null,1965,"1965-04-18"]
[2066,"2066-01-01","00:00:00","2066-04-11","2066-04-12","2066-05-01","2066-05-08","2066-05-20","2066-05-30","2066-05-31","2066-07-14","2066-08-15","2066-11-01","2066-11-11","2066-12-25","00:00:00",null,null,1966,"1966-04-10"]
[2067,"2067-01-01","00:00:00","2067-04-03","2067-04-04","2067-05-01","2067-05-08","2067-05-12","2067-05-22","2067-05-23","2067-07-14","2067-08-15","2067-11-01","2067-11-11","2067-12-25","00:00:00",null,null,1967,"1967-03-26"]
[2068,"2068-01-01","00:00:00","2068-04-22","2068-04-23","2068-05-01","2068-05-08","2068-05-31","2068-06-10","2068-06-11","2068-07-14","2068-08-15","2068-11-01","2068-11-11","2068-12-25","00:00:00",null,null,1968,"1968-04-14"]
[2069,"2069-01-01","00:00:00","2069-04-14","2069-04-15","2069-05-01","2069-05-08","2069-05-23","2069-06-02","2069-06-03","2069-07-14","2069-08-15","2069-11-01","2069-11-11","2069-12-25","00:00:00",null,null,1969,"1969-04-06"]
[2070,"2070-01-01","00:00:00","2070-03-30","2070-03-31","2070-05-01","2070-05-08","2070-05-08","2070-05-18","2070-05-19","2070-07-14","2070-08-15","2070-11-01","2070-11-11","2070-12-25","00:00:00",null,null,1970,"1970-03-29"]
[2071,"2071-01-01","00:00:00","2071-04-19","2071-04-20","2071-05-01","2071-05-08","2071-05-28","2071-06-07","2071-06-08","2071-07-14","2071-08-15","2071-11-01","2071-11-11","2071-12-25","00:00:00",null,null,1971,"1971-04-11"]
[2072,"2072-01-01","00:00:00","2072-04-10","2072-04-11","2072-05-01","2072-05-08","2072-05-19","2072-05-29","2072-05-30","2072-07-14","2072-08-15","2072-11-01","2072-11-11","2072-12-25","00:00:00",null,null,1972,"1972-04-02"]
[2073,"2073-01-01","00:00:00","2073-03-26","2073-03-27","2073-05-01","2073-05-08","2073-05-04","2073-05-14","2073-05-15","2073-07-14","2073-08-15","2073-11-01","2073-11-11","2073-12-25","00:00:00",null,null,1973,"1973-04-22"]
[2074,"2074-01-01","00:00:00","2074-04-15","2074-04-16","2074-05-01","2074-05-08","2074-05-24","2074-06-03","2074-06-04","2074-07-14","2074-08-15","2074-11-01","2074-11-11","2074-12-25","00:00:00",null,null,1974,"1974-04-14"]
[2075,"2075-01-01","00:00:00","2075-04-07","2075-04-08","2075-05-01","2075-05-08","2075-05-16","2075-05-26","2075-05-27","2075-07-14","2075-08-15","2075-11-01","2075-11-11","2075-12-25","00:00:00",null,null,1975,"1975-03-30"]
[2076,"2076-01-01","00:00:00","2076-04-19","2076-04-20","2076-05-01","2076-05-08","2076-05-28","2076-06-07","2076-06-08","2076-07-14","2076-08-15","2076-11-01","2076-11-11","2076-12-25","00:00:00",null,null,1976,"1976-04-18"]
[2077,"2077-01-01","00:00:00","2077-04-11","2077-04-12","2077-05-01","2077-05-08","2077-05-20","2077-05-30","2077-05-31","2077-07-14","2077-08-15","2077-11-01","2077-11-11","2077-12-25","00:00:00",null,null,1977,"1977-04-10"]
[2078,"2078-01-01","00:00:00","2078-04-03","2078-04-04","2078-05-01","2078-05-08","2078-05-12","2078-05-22","2078-05-23","2078-07-14","2078-08-15","2078-11-01","2078-11-11","2078-12-25","00:00:00",null,null,1978,"1978-03-26"]
[2079,"2079-01-01","00:00:00","2079-04-23","2079-04-24","2079-05-01","2079-05-08","2079-06-01","2079-06-11","2079-06-12","2079-07-14","2079-08-15","2079-11-01","2079-11-11","2079-12-25","00:00:00",null,null,1979,"1979-04-15"]
[2080,"2080-01-01","00:00:00","2080-04-07","2080-04-08","2080-05-01","2080-05-08","2080-05-16","2080-05-26","2080-05-27","2080-07-14","2080-08-15","2080-11-01","2080-11-11","2080-12-25","00:00:00",null,null,1980,"1980-04-06"]
[2081,"2081-01-01","00:00:00","2081-03-30","2081-03-31","2081-05-01","2081-05-08","2081-05-08","2081-05-18","2081-05-19","2081-07-14","2081-08-15","2081-11-01","2081-11-11","2081-12-25","00:00:00",null,null,1981,"1981-04-19"]
[2082,"2082-01-01","00:00:00","2082-04-19","2082-04-20","2082-05-01","2082-05-08","2082-05-28","2082-06-07","2082-06-08","2082-07-14","2082-08-15","2082-11-01","2082-11-11","2082-12-25","00:00:00",null,null,1982,"1982-04-11"]
[2083,"2083-01-01","00:00:00","2083-04-04","2083-04-05","2083-05-01","2083-05-08","2083-05-13","2083-05-23","2083-05-24","2083-07-14","2083-08-15","2083-11-01","2083-11-11","2083-12-25","00:00:00",null,null,1983,"1983-04-03"]
[2084,"2084-01-01","00:00:00","2084-03-26","2084-03-27","2084-05-01","2084-05-08","2084-05-04","2084-05-14","2084-05-15","2084-07-14","2084-08-15","2084-11-01","2084-11-11","2084-12-25","00:00:00",null,null,1984,"1984-04-22"]
[2085,"2085-01-01","00:00:00","2085-04-15","2085-04-16","2085-05-01","2085-05-08","2085-05-24","2085-06-03","2085-06-04","2085-07-14","2085-08-15","2085-11-01","2085-11-11","2085-12-25","00:00:00",null,null,1985,"1985-04-07"]
[2086,"2086-01-01","00:00:00","2086-03-31","2086-04-01","2086-05-01","2086-05-08","2086-05-09","2086-05-19","2086-05-20","2086-07-14","2086-08-15","2086-11-01","2086-11-11","2086-12-25","00:00:00",null,null,1986,"1986-03-30"]
[2087,"2087-01-01","00:00:00","2087-04-20","2087-04-21","2087-05-01","2087-05-08","2087-05-29","2087-06-08","2087-06-09","2087-07-14","2087-08-15","2087-11-01","2087-11-11","2087-12-25","00:00:00",null,null,1987,"1987-04-19"]
[2088,"2088-01-01","00:00:00","2088-04-11","2088-04-12","2088-05-01","2088-05-08","2088-05-20","2088-05-30","2088-05-31","2088-07-14","2088-08-15","2088-11-01","2088-11-11","2088-12-25","00:00:00",null,null,1988,"1988-04-03"]
[2089,"2089-01-01","00:00:00","2089-04-03","2089-04-04","2089-05-01","2089-05-08","2089-05-12","2089-05-22","2089-05-23","2089-07-14","2089-08-15","2089-11-01","2089-11-11","2089-12-25","00:00:00",null,null,1989,"1989-03-26"]
[2090,"2090-01-01","00:00:00","2090-04-16","2090-04-17","2090-05-01","2090-05-08","2090-05-25","2090-06-04","2090-06-05","2090-07-14","2090-08-15","2090-11-01","2090-11-11","2090-12-25","00:00:00",null,null,1990,"1990-04-15"]
[2091,"2091-01-01","00:00:00","2091-04-08","2091-04-09","2091-05-01","2091-05-08","2091-05-17","2091-05-27","2091-05-28","2091-07-14","2091-08-15","2091-11-01","2091-11-11","2091-12-25","00:00:00",null,null,1991,"1991-03-31"]
[2092,"2092-01-01","00:00:00","2092-03-30","2092-03-31","2092-05-01","2092-05-08","2092-05-08","2092-05-18","2092-05-19","2092-07-14","2092-08-15","2092-11-01","2092-11-11","2092-12-25","00:00:00",null,null,1992,"1992-04-19"]
[2093,"2093-01-01","00:00:00","2093-04-12","2093-04-13","2093-05-01","2093-05-08","2093-05-21","2093-05-31","2093-06-01","2093-07-14","2093-08-15","2093-11-01","2093-11-11","2093-12-25","00:00:00",null,null,1993,"1993-04-11"]
[2094,"2094-01-01","00:00:00","2094-04-04","2094-04-05","2094-05-01","2094-05-08","2094-05-13","2094-05-23","2094-05-24","2094-07-14","2094-08-15","2094-11-01","2094-11-11","2094-12-25","00:00:00",null,null,1994,"1994-04-03"]
[2095,"2095-01-01","00:00:00","2095-04-24","2095-04-25","2095-05-01","2095-05-08","2095-06-02","2095-06-12","2095-06-13","2095-07-14","2095-08-15","2095-11-01","2095-11-11","2095-12-25","00:00:00",null,null,1995,"1995-04-16"]
[2096,"2096-01-01",{"$f":"IF(AND(mode_Alsace,mode_France),D98-2,0)","v":"00:00:00"},{"$f":"VLOOKUP(A98,table_Paques,2,0)","v":"2096-04-15"},"2096-04-16","2096-05-01","2096-05-08","2096-05-24","2096-06-03","2096-06-04",{"$f":"DATE($A98,MONTH(fete_nat),DAY(fete_nat))","v":"2096-07-14"},"2096-08-15","2096-11-01","2096-11-11","2096-12-25","00:00:00",null,null,1996,"1996-04-07"]
[2097,"2097-01-01",{"$f":"IF(AND(mode_Alsace,mode_France),D99-2,0)","v":"00:00:00"},{"$f":"VLOOKUP(A99,table_Paques,2,0)","v":"2097-03-31"},"2097-04-01","2097-05-01","2097-05-08","2097-05-09","2097-05-19","2097-05-20",{"$f":"DATE($A99,MONTH(fete_nat),DAY(fete_nat))","v":"2097-07-14"},"2097-08-15","2097-11-01","2097-11-11","2097-12-25","00:00:00",null,null,1997,"1997-03-30"]
[2098,"2098-01-01",{"$f":"IF(AND(mode_Alsace,mode_France),D100-2,0)","v":"00:00:00"},{"$f":"VLOOKUP(A100,table_Paques,2,0)","v":"2098-04-20"},"2098-04-21","2098-05-01","2098-05-08","2098-05-29","2098-06-08","2098-06-09",{"$f":"DATE($A100,MONTH(fete_nat),DAY(fete_nat))","v":"2098-07-14"},"2098-08-15","2098-11-01","2098-11-11","2098-12-25","00:00:00",null,null,1998,"1998-04-12"]
[2099,"2099-01-01",{"$f":"IF(AND(mode_Alsace,mode_France),D101-2,0)","v":"00:00:00"},{"$f":"VLOOKUP(A101,table_Paques,2,0)","v":"2099-04-12"},"2099-04-13","2099-05-01","2099-05-08","2099-05-21","2099-05-31","2099-06-01",{"$f":"DATE($A101,MONTH(fete_nat),DAY(fete_nat))","v":"2099-07-14"},"2099-08-15","2099-11-01","2099-11-11","2099-12-25","00:00:00",null,null,1999,"1999-04-04"]
[2100,"2100-01-01",{"$f":"IF(AND(mode_Alsace,mode_France),D102-2,0)","v":"00:00:00"},{"$f":"VLOOKUP(A102,table_Paques,2,0)","v":"2100-03-28"},"2100-03-29","2100-05-01","2100-05-08","2100-05-06","2100-05-16","2100-05-17",{"$f":"DATE($A102,MONTH(fete_nat),DAY(fete_nat))","v":"2100-07-14"},"2100-08-15","2100-11-01","2100-11-11","2100-12-25","00:00:00",null,null,2000,"2000-04-23"]
[null,null,null,null,null,null,null,null,null,null,null,null,null,null,null,null,null,null,2001,"2001-04-15"]
[null,null,null,null,null,null,null,null,null,null,null,null,null,null,null,null,null,null,2002,"2002-03-31"]
[null,null,null,null,null,null,null,null,null,null,null,null,null,null,null,null,null,null,2003,"2003-04-20"]
[null,null,null,null,null,null,null,null,null,null,null,null,null,null,null,null,null,null,2004,"2004-04-11"]
[null,null,null,null,null,null,null,null,null,null,null,null,null,null,null,null,null,null,2005,"2005-03-27"]
[null,null,null,null,null,null,null,null,null,null,null,null,null,null,null,null,null,null,2006,"2006-04-16"]
[null,null,null,null,null,null,null,null,null,null,null,null,null,null,null,null,null,null,2007,"2007-04-08"]
[null,null,null,null,null,null,null,null,null,null,null,null,null,null,null,null,null,null,2008,"2008-03-23"]
[null,null,null,null,null,null,null,null,null,null,null,null,null,null,null,null,null,null,2009,"2009-04-12"]
[null,null,null,null,null,null,null,null,null,null,null,null,null,null,null,null,null,null,2010,"2010-04-04"]
[null,null,null,null,null,null,null,null,null,null,null,null,null,null,null,null,null,null,2011,"2011-04-24"]
[null,null,null,null,null,null,null,null,null,null,null,null,null,null,null,null,null,null,2012,"2012-04-08"]
[null,null,null,null,null,null,null,null,null,null,null,null,null,null,null,null,null,null,2013,"2013-03-31"]
[null,null,null,null,null,null,null,null,null,null,null,null,null,null,null,null,null,null,2014,"2014-04-20"]
[null,null,null,null,null,null,null,null,null,null,null,null,null,null,null,null,null,null,2015,"2015-04-05"]
[null,null,null,null,null,null,null,null,null,null,null,null,null,null,null,null,null,null,2016,"2016-03-27"]
[null,null,null,null,null,null,null,null,null,null,null,null,null,null,null,null,null,null,2017,"2017-04-16"]
[null,null,null,null,null,null,null,null,null,null,null,null,null,null,null,null,null,null,2018,"2018-04-01"]
[null,null,null,null,null,null,null,null,null,null,null,null,null,null,null,null,null,null,2019,"2019-04-21"]
[null,null,null,null,null,null,null,null,null,null,null,null,null,null,null,null,null,null,2020,"2020-04-12"]
[null,null,null,null,null,null,null,null,null,null,null,null,null,null,null,null,null,null,2021,"2021-04-04"]
[null,null,null,null,null,null,null,null,null,null,null,null,null,null,null,null,null,null,2022,"2022-04-17"]
[null,null,null,null,null,null,null,null,null,null,null,null,null,null,null,null,null,null,2023,"2023-04-09"]
[null,null,null,null,null,null,null,null,null,null,null,null,null,null,null,null,null,null,2024,"2024-03-31"]
[null,null,null,null,null,null,null,null,null,null,null,null,null,null,null,null,null,null,2025,"2025-04-20"]
[null,null,null,null,null,null,null,null,null,null,null,null,null,null,null,null,null,null,2026,"2026-04-05"]
[null,null,null,null,null,null,null,null,null,null,null,null,null,null,null,null,null,null,2027,"2027-03-28"]
[null,null,null,null,null,null,null,null,null,null,null,null,null,null,null,null,null,null,2028,"2028-04-16"]
[null,null,null,null,null,null,null,null,null,null,null,null,null,null,null,null,null,null,2029,"2029-04-01"]
[null,null,null,null,null,null,null,null,null,null,null,null,null,null,null,null,null,null,2030,"2030-04-21"]
[null,null,null,null,null,null,null,null,null,null,null,null,null,null,null,null,null,null,2031,"2031-04-13"]
[null,null,null,null,null,null,null,null,null,null,null,null,null,null,null,null,null,null,2032,"2032-03-28"]
[null,null,null,null,null,null,null,null,null,null,null,null,null,null,null,null,null,null,2033,"2033-04-17"]
[null,null,null,null,null,null,null,null,null,null,null,null,null,null,null,null,null,null,2034,"2034-04-09"]
[null,null,null,null,null,null,null,null,null,null,null,null,null,null,null,null,null,null,2035,"2035-03-25"]
[null,null,null,null,null,null,null,null,null,null,null,null,null,null,null,null,null,null,2036,"2036-04-13"]
[null,null,null,null,null,null,null,null,null,null,null,null,null,null,null,null,null,null,2037,"2037-04-05"]
[null,null,null,null,null,null,null,null,null,null,null,null,null,null,null,null,null,null,2038,"2038-04-25"]
[null,null,null,null,null,null,null,null,null,null,null,null,null,null,null,null,null,null,2039,"2039-04-10"]
[null,null,null,null,null,null,null,null,null,null,null,null,null,null,null,null,null,null,2040,"2040-04-01"]
[null,null,null,null,null,null,null,null,null,null,null,null,null,null,null,null,null,null,2041,"2041-04-21"]
[null,null,null,null,null,null,null,null,null,null,null,null,null,null,null,null,null,null,2042,"2042-04-06"]
[null,null,null,null,null,null,null,null,null,null,null,null,null,null,null,null,null,null,2043,"2043-03-29"]
[null,null,null,null,null,null,null,null,null,null,null,null,null,null,null,null,null,null,2044,"2044-04-17"]
[null,null,null,null,null,null,null,null,null,null,null,null,null,null,null,null,null,null,2045,"2045-04-09"]
[null,null,null,null,null,null,null,null,null,null,null,null,null,null,null,null,null,null,2046,"2046-03-25"]
[null,null,null,null,null,null,null,null,null,null,null,null,null,null,null,null,null,null,2047,"2047-04-14"]
[null,null,null,null,null,null,null,null,null,null,null,null,null,null,null,null,null,null,2048,"2048-04-05"]
[null,null,null,null,null,null,null,null,null,null,null,null,null,null,null,null,null,null,2049,"2049-04-18"]
[null,null,null,null,null,null,null,null,null,null,null,null,null,null,null,null,null,null,2050,"2050-04-10"]
[null,null,null,null,null,null,null,null,null,null,null,null,null,null,null,null,null,null,2051,"2051-04-02"]
[null,null,null,null,null,null,null,null,null,null,null,null,null,null,null,null,null,null,2052,"2052-04-21"]
[null,null,null,null,null,null,null,null,null,null,null,null,null,null,null,null,null,null,2053,"2053-04-06"]
[null,null,null,null,null,null,null,null,null,null,null,null,null,null,null,null,null,null,2054,"2054-03-29"]
[null,null,null,null,null,null,null,null,null,null,null,null,null,null,null,null,null,null,2055,"2055-04-18"]
[null,null,null,null,null,null,null,null,null,null,null,null,null,null,null,null,null,null,2056,"2056-04-02"]
[null,null,null,null,null,null,null,null,null,null,null,null,null,null,null,null,null,null,2057,"2057-04-22"]
[null,null,null,null,null,null,null,null,null,null,null,null,null,null,null,null,null,null,2058,"2058-04-14"]
[null,null,null,null,null,null,null,null,null,null,null,null,null,null,null,null,null,null,2059,"2059-03-30"]
[null,null,null,null,null,null,null,null,null,null,null,null,null,null,null,null,null,null,2060,"2060-04-18"]
[null,null,null,null,null,null,null,null,null,null,null,null,null,null,null,null,null,null,2061,"2061-04-10"]
[null,null,null,null,null,null,null,null,null,null,null,null,null,null,null,null,null,null,2062,"2062-03-26"]
[null,null,null,null,null,null,null,null,null,null,null,null,null,null,null,null,null,null,2063,"2063-04-15"]
[null,null,null,null,null,null,null,null,null,null,null,null,null,null,null,null,null,null,2064,"2064-04-06"]
[null,null,null,null,null,null,null,null,null,null,null,null,null,null,null,null,null,null,2065,"2065-03-29"]
[null,null,null,null,null,null,null,null,null,null,null,null,null,null,null,null,null,null,2066,"2066-04-11"]
[null,null,null,null,null,null,null,null,null,null,null,null,null,null,null,null,null,null,2067,"2067-04-03"]
[null,null,null,null,null,null,null,null,null,null,null,null,null,null,null,null,null,null,2068,"2068-04-22"]
[null,null,null,null,null,null,null,null,null,null,null,null,null,null,null,null,null,null,2069,"2069-04-14"]
[null,null,null,null,null,null,null,null,null,null,null,null,null,null,null,null,null,null,2070,"2070-03-30"]
[null,null,null,null,null,null,null,null,null,null,null,null,null,null,null,null,null,null,2071,"2071-04-19"]
[null,null,null,null,null,null,null,null,null,null,null,null,null,null,null,null,null,null,2072,"2072-04-10"]
[null,null,null,null,null,null,null,null,null,null,null,null,null,null,null,null,null,null,2073,"2073-03-26"]
[null,null,null,null,null,null,null,null,null,null,null,null,null,null,null,null,null,null,2074,"2074-04-15"]
[null,null,null,null,null,null,null,null,null,null,null,null,null,null,null,null,null,null,2075,"2075-04-07"]
[null,null,null,null,null,null,null,null,null,null,null,null,null,null,null,null,null,null,2076,"2076-04-19"]
[null,null,null,null,null,null,null,null,null,null,null,null,null,null,null,null,null,null,2077,"2077-04-11"]
[null,null,null,null,null,null,null,null,null,null,null,null,null,null,null,null,null,null,2078,"2078-04-03"]
[null,null,null,null,null,null,null,null,null,null,null,null,null,null,null,null,null,null,2079,"2079-04-23"]
[null,null,null,null,null,null,null,null,null,null,null,null,null,null,null,null,null,null,2080,"2080-04-07"]
[null,null,null,null,null,null,null,null,null,null,null,null,null,null,null,null,null,null,2081,"2081-03-30"]
[null,null,null,null,null,null,null,null,null,null,null,null,null,null,null,null,null,null,2082,"2082-04-19"]
[null,null,null,null,null,null,null,null,null,null,null,null,null,null,null,null,null,null,2083,"2083-04-04"]
[null,null,null,null,null,null,null,null,null,null,null,null,null,null,null,null,null,null,2084,"2084-03-26"]
[null,null,null,null,null,null,null,null,null,null,null,null,null,null,null,null,null,null,2085,"2085-04-15"]
[null,null,null,null,null,null,null,null,null,null,null,null,null,null,null,null,null,null,2086,"2086-03-31"]
[null,null,null,null,null,null,null,null,null,null,null,null,null,null,null,null,null,null,2087,"2087-04-20"]
[null,null,null,null,null,null,null,null,null,null,null,null,null,null,null,null,null,null,2088,"2088-04-11"]
[null,null,null,null,null,null,null,null,null,null,null,null,null,null,null,null,null,null,2089,"2089-04-03"]
[null,null,null,null,null,null,null,null,null,null,null,null,null,null,null,null,null,null,2090,"2090-04-16"]
[null,null,null,null,null,null,null,null,null,null,null,null,null,null,null,null,null,null,2091,"2091-04-08"]
[null,null,null,null,null,null,null,null,null,null,null,null,null,null,null,null,null,null,2092,"2092-03-30"]
[null,null,null,null,null,null,null,null,null,null,null,null,null,null,null,null,null,null,2093,"2093-04-12"]
[null,null,null,null,null,null,null,null,null,null,null,null,null,null,null,null,null,null,2094,"2094-04-04"]
[null,null,null,null,null,null,null,null,null,null,null,null,null,null,null,null,null,null,2095,"2095-04-24"]
[null,null,null,null,null,null,null,null,null,null,null,null,null,null,null,null,null,null,2096,"2096-04-15"]
[null,null,null,null,null,null,null,null,null,null,null,null,null,null,null,null,null,null,2097,"2097-03-31"]
[null,null,null,null,null,null,null,null,null,null,null,null,null,null,null,null,null,null,2098,"2098-04-20"]
[null,null,null,null,null,null,null,null,null,null,null,null,null,null,null,null,null,null,2099,"2099-04-12"]
[null,null,null,null,null,null,null,null,null,null,null,null,null,null,null,null,null,null,2100,"2100-03-28"]
[null,null,null,null,null,null,null,null,null,null,null,null,null,null,null,null,null,null,2101,"2101-04-17"]
[null,null,null,null,null,null,null,null,null,null,null,null,null,null,null,null,null,null,2102,"2102-04-09"]
[null,null,null,null,null,null,null,null,null,null,null,null,null,null,null,null,null,null,2103,"2103-03-25"]
[null,null,null,null,null,null,null,null,null,null,null,null,null,null,null,null,null,null,2104,"2104-04-13"]
[null,null,null,null,null,null,null,null,null,null,null,null,null,null,null,null,null,null,2105,"2105-04-05"]
[null,null,null,null,null,null,null,null,null,null,null,null,null,null,null,null,null,null,2106,"2106-04-18"]
[null,null,null,null,null,null,null,null,null,null,null,null,null,null,null,null,null,null,2107,"2107-04-10"]
[null,null,null,null,null,null,null,null,null,null,null,null,null,null,null,null,null,null,2108,"2108-04-01"]
[null,null,null,null,null,null,null,null,null,null,null,null,null,null,null,null,null,null,2109,"2109-04-21"]
[null,null,null,null,null,null,null,null,null,null,null,null,null,null,null,null,null,null,2110,"2110-04-06"]
[null,null,null,null,null,null,null,null,null,null,null,null,null,null,null,null,null,null,2111,"2111-03-29"]
[null,null,null,null,null,null,null,null,null,null,null,null,null,null,null,null,null,null,2112,"2112-04-17"]
[null,null,null,null,null,null,null,null,null,null,null,null,null,null,null,null,null,null,2113,"2113-04-02"]
[null,null,null,null,null,null,null,null,null,null,null,null,null,null,null,null,null,null,2114,"2114-04-22"]
[null,null,null,null,null,null,null,null,null,null,null,null,null,null,null,null,null,null,2115,"2115-04-14"]
[null,null,null,null,null,null,null,null,null,null,null,null,null,null,null,null,null,null,2116,"2116-03-29"]
[null,null,null,null,null,null,null,null,null,null,null,null,null,null,null,null,null,null,2117,"2117-04-18"]
[null,null,null,null,null,null,null,null,null,null,null,null,null,null,null,null,null,null,2118,"2118-04-10"]
[null,null,null,null,null,null,null,null,null,null,null,null,null,null,null,null,null,null,2119,"2119-03-26"]
[null,null,null,null,null,null,null,null,null,null,null,null,null,null,null,null,null,null,2120,"2120-04-14"]
[null,null,null,null,null,null,null,null,null,null,null,null,null,null,null,null,null,null,2121,"2121-04-06"]
[null,null,null,null,null,null,null,null,null,null,null,null,null,null,null,null,null,null,2122,"2122-03-29"]

{"sheet":"vacances scolaires","index":4,"n_rows":440,"n_cols":17,"rows_kept":440,"cut":false,"hidden":false,"merged":[[21,16,21,18]]}
["Made by Jean-Marc Stoeffler","A","ZONE A","B","ZONE B","C","ZONE C",null,"choix->",4,"A","B","C","T","choix"]
["2015-08-29","Académies :\nBesançon, Bordeaux, Clermont-Ferrand, Dijon, Grenoble, Limoges, Lyon, Poitiers ",null,"Académies :\nAix-Marseille, Amiens, Caen, Lille, Nancy-Metz, Nantes, Nice, Orléans-Tours, Reims, Rennes, Rouen, Strasbourg ",null,"Académies :\nCréteil, Montpellier, Paris, Toulouse, Versailles",null,null,"http://www.education.gouv.fr/pid25058/le-calendrier-scolaire.html"]
["2015-02-28T15:46:00","début","fin","début","fin","début","fin",null,"V_min",{"$f":"MIN(B:G)","v":"1901-02-28"}]
[{"$f":"\"vacances d'été \"&CHAR(10)&TEXT(B4+7,\"\"\"(\"\"mmm aaaa\"\"-\"\"\")&TEXT(C4+7,\"mmm aaaa\"\")\"\"\")","v":"vacances d'été \n(juil 2015-sept 2015)"},"2015-07-04",{"$f":"B4+58","v":"2015-08-31"},{"$f":"B4","v":"2015-07-04"},"2015-08-31","2015-07-04","2015-08-31",null,"V_Max",{"$f":"MAX(B:G)","v":"6309-06-10"},null,null,null,null,null,1,"AUCUNE"]
[{"$f":"\"Vacances de la Toussaint \"&CHAR(10)&TEXT(B5,\"\"\"(\"\"mmmm aaaa\"\")\"\"\")","v":"Vacances de la Toussaint \n(octobre 2015)"},"2015-10-17",{"$f":"B5+16","v":"2015-11-02"},"2015-10-17","2015-11-02","2015-10-17","2015-11-02",null,"StatutChargement","J",null,null,null,null,null,2,{"$f":"C1","v":"ZONE A"}]
[{"$f":"\"Vacances de Noël \"&CHAR(10)&TEXT(B6,\"\"\"(\"\"mmmm aaaa\"\")\"\"\")","v":"Vacances de Noël \n(décembre 2015)"},"2015-12-19",{"$f":"B6+16","v":"2016-01-04"},"2015-12-19","2016-01-04","2015-12-19","2016-01-04",null,null,null,null,null,null,null,null,3,{"$f":"E1","v":"ZONE B"}]
[{"$f":"\"Vacances d'hiver \"&CHAR(10)&TEXT(B7,\"\"\"(\"\"mmmm aaaa\"\")\"\"\")","v":"Vacances d'hiver \n(février 2016)"},"2016-02-13",{"$f":"B7+16","v":"2016-02-29"},"2016-02-06",{"$f":"D7+16","v":"2016-02-22"},"2016-02-20",{"$f":"F7+16","v":"2016-03-07"},null,null,null,null,null,null,null,null,4,{"$f":"G1","v":"ZONE C"}]
[{"$f":"\"Vacances de printemps \"&CHAR(10)&TEXT(B8,\"\"\"(\"\"mmmm aaaa\"\")\"\"\")","v":"Vacances de printemps \n(avril 2016)"},"2016-04-09",{"$f":"B8+16","v":"2016-04-25"},"2016-04-02",{"$f":"D8+16","v":"2016-04-18"},"2016-04-16",{"$f":"F8+16","v":"2016-05-02"},null,null,null,null,null,null,null,null,5,"TOUTES ZONES"]
[{"$f":"\"vacances d'été \"&CHAR(10)&TEXT(B9+7,\"\"\"(\"\"mmm aaaa\"\"-\"\"\")&TEXT(C9+7,\"mmm aaaa\"\")\"\"\")","v":"vacances d'été \n(juil 2016-sept 2016)"},"2016-07-05",{"$f":"B9+58","v":"2016-09-01"},{"$f":"B9","v":"2016-07-05"},{"$f":"C9","v":"2016-09-01"},{"$f":"D9","v":"2016-07-05"},{"$f":"E9","v":"2016-09-01"}]
[null,{"$f":"INT(SUM(A1:G9))","v":1610516},null,null,null,null,null,null,{"$f":"MIN(B4:G9)","v":"2015-07-04"},null,{"$f":"IF(OR(AND(d>V_1 A_1,d<V_1 A_2),AND(d>V_2 A_1,d<V_2 A_2),AND(d>V_3 A_1,d<V_3 A_2),AND(d>V_4 A_1,d<V_4 A_2),AND(d>V_5 A_1,d<V_5 A_2),AND(d>V_6 A_1,d<V_6 A_2)),d,0)","v":0},{"$f":"IF(OR(AND(d>V_1 B_1,d<V_1 B_2),AND(d>V_2 B_1,d<V_2 B_2),AND(d>V_3 B_1,d<V_3 B_2),AND(d>V_4 B_1,d<V_4 B_2),AND(d>V_5 B_1,d<V_5 B_2),AND(d>V_6 B_1,d<V_6 B_2)),d,0)","v":0},{"$f":"IF(OR(AND(d>V_1 C_1,d<V_1 C_2),AND(d>V_2 C_1,d<V_2 C_2),AND(d>V_3 C_1,d<V_3 C_2),AND(d>V_4 C_1,d<V_4 C_2),AND(d>V_5 C_1,d<V_5 C_2),AND(d>V_6 C_1,d<V_6 C_2)),d,0)","v":0},{"$f":"MAX(K10:M10)","v":0},{"$f":"INDEX(J10:N10,choix_zone)","v":0}]
["http://www.doublevez.com/calendrier",{"$f":"MAX(B9:G9)-MIN(B4:G4)","v":425},null,null,null,null,null,null,{"$f":"I10+1","v":"2015-07-05"},null,{"$f":"IF(OR(AND(d>V_1 A_1,d<V_1 A_2),AND(d>V_2 A_1,d<V_2 A_2),AND(d>V_3 A_1,d<V_3 A_2),AND(d>V_4 A_1,d<V_4 A_2),AND(d>V_5 A_1,d<V_5 A_2),AND(d>V_6 A_1,d<V_6 A_2)),d,0)","v":42190},{"$f":"IF(OR(AND(d>V_1 B_1,d<V_1 B_2),AND(d>V_2 B_1,d<V_2 B_2),AND(d>V_3 B_1,d<V_3 B_2),AND(d>V_4 B_1,d<V_4 B_2),AND(d>V_5 B_1,d<V_5 B_2),AND(d>V_6 B_1,d<V_6 B_2)),d,0)","v":42190},{"$f":"IF(OR(AND(d>V_1 C_1,d<V_1 C_2),AND(d>V_2 C_1,d<V_2 C_2),AND(d>V_3 C_1,d<V_3 C_2),AND(d>V_4 C_1,d<V_4 C_2),AND(d>V_5 C_1,d<V_5 C_2),AND(d>V_6 C_1,d<V_6 C_2)),d,0)","v":42190},42190,42190]
["2014-2015",null,null,null,null,null,null,null,{"$f":"I11+1","v":"2015-07-06"},null,{"$f":"IF(OR(AND(d>V_1 A_1,d<V_1 A_2),AND(d>V_2 A_1,d<V_2 A_2),AND(d>V_3 A_1,d<V_3 A_2),AND(d>V_4 A_1,d<V_4 A_2),AND(d>V_5 A_1,d<V_5 A_2),AND(d>V_6 A_1,d<V_6 A_2)),d,0)","v":42191},{"$f":"IF(OR(AND(d>V_1 B_1,d<V_1 B_2),AND(d>V_2 B_1,d<V_2 B_2),AND(d>V_3 B_1,d<V_3 B_2),AND(d>V_4 B_1,d<V_4 B_2),AND(d>V_5 B_1,d<V_5 B_2),AND(d>V_6 B_1,d<V_6 B_2)),d,0)","v":42191},{"$f":"IF(OR(AND(d>V_1 C_1,d<V_1 C_2),AND(d>V_2 C_1,d<V_2 C_2),AND(d>V_3 C_1,d<V_3 C_2),AND(d>V_4 C_1,d<V_4 C_2),AND(d>V_5 C_1,d<V_5 C_2),AND(d>V_6 C_1,d<V_6 C_2)),d,0)","v":42191},42191,42191]
[{"$f":"\"calendrier.\"&A12&\".Zone.\"&C13&\".vacances.scolaires.gif\"","v":"calendrier.2014-2015.Zone.A.vacances.scolaires.gif"},null,"A",null,null,null,null,null,"2015-07-07",null,{"$f":"IF(OR(AND(d>V_1 A_1,d<V_1 A_2),AND(d>V_2 A_1,d<V_2 A_2),AND(d>V_3 A_1,d<V_3 A_2),AND(d>V_4 A_1,d<V_4 A_2),AND(d>V_5 A_1,d<V_5 A_2),AND(d>V_6 A_1,d<V_6 A_2)),d,0)","v":42192},{"$f":"IF(OR(AND(d>V_1 B_1,d<V_1 B_2),AND(d>V_2 B_1,d<V_2 B_2),AND(d>V_3 B_1,d<V_3 B_2),AND(d>V_4 B_1,d<V_4 B_2),AND(d>V_5 B_1,d<V_5 B_2),AND(d>V_6 B_1,d<V_6 B_2)),d,0)","v":42192},{"$f":"IF(OR(AND(d>V_1 C_1,d<V_1 C_2),AND(d>V_2 C_1,d<V_2 C_2),AND(d>V_3 C_1,d<V_3 C_2),AND(d>V_4 C_1,d<V_4 C_2),AND(d>V_5 C_1,d<V_5 C_2),AND(d>V_6 C_1,d<V_6 C_2)),d,0)","v":42192},42192,42192]
["calendrier.2013-2014.Zone.B.vacances.scolaires.gif",null,"B",null,null,null,null,null,"2015-07-08",null,{"$f":"IF(OR(AND(d>V_1 A_1,d<V_1 A_2),AND(d>V_2 A_1,d<V_2 A_2),AND(d>V_3 A_1,d<V_3 A_2),AND(d>V_4 A_1,d<V_4 A_2),AND(d>V_5 A_1,d<V_5 A_2),AND(d>V_6 A_1,d<V_6 A_2)),d,0)","v":42193},{"$f":"IF(OR(AND(d>V_1 B_1,d<V_1 B_2),AND(d>V_2 B_1,d<V_2 B_2),AND(d>V_3 B_1,d<V_3 B_2),AND(d>V_4 B_1,d<V_4 B_2),AND(d>V_5 B_1,d<V_5 B_2),AND(d>V_6 B_1,d<V_6 B_2)),d,0)","v":42193},{"$f":"IF(OR(AND(d>V_1 C_1,d<V_1 C_2),AND(d>V_2 C_1,d<V_2 C_2),AND(d>V_3 C_1,d<V_3 C_2),AND(d>V_4 C_1,d<V_4 C_2),AND(d>V_5 C_1,d<V_5 C_2),AND(d>V_6 C_1,d<V_6 C_2)),d,0)","v":42193},42193,42193]
["calendrier.2013-2014.Zone.C.vacances.scolaires.gif",null,"C",null,null,null,null,null,"2015-07-09",null,{"$f":"IF(OR(AND(d>V_1 A_1,d<V_1 A_2),AND(d>V_2 A_1,d<V_2 A_2),AND(d>V_3 A_1,d<V_3 A_2),AND(d>V_4 A_1,d<V_4 A_2),AND(d>V_5 A_1,d<V_5 A_2),AND(d>V_6 A_1,d<V_6 A_2)),d,0)","v":42194},{"$f":"IF(OR(AND(d>V_1 B_1,d<V_1 B_2),AND(d>V_2 B_1,d<V_2 B_2),AND(d>V_3 B_1,d<V_3 B_2),AND(d>V_4 B_1,d<V_4 B_2),AND(d>V_5 B_1,d<V_5 B_2),AND(d>V_6 B_1,d<V_6 B_2)),d,0)","v":42194},{"$f":"IF(OR(AND(d>V_1 C_1,d<V_1 C_2),AND(d>V_2 C_1,d<V_2 C_2),AND(d>V_3 C_1,d<V_3 C_2),AND(d>V_4 C_1,d<V_4 C_2),AND(d>V_5 C_1,d<V_5 C_2),AND(d>V_6 C_1,d<V_6 C_2)),d,0)","v":42194},42194,42194]
["calendrier.2013-2014.Zones.A.B.C.vacances.scolaires.gif",null,"ABC",null,null,null,null,null,"2015-07-10",null,{"$f":"IF(OR(AND(d>V_1 A_1,d<V_1 A_2),AND(d>V_2 A_1,d<V_2 A_2),AND(d>V_3 A_1,d<V_3 A_2),AND(d>V_4 A_1,d<V_4 A_2),AND(d>V_5 A_1,d<V_5 A_2),AND(d>V_6 A_1,d<V_6 A_2)),d,0)","v":42195},{"$f":"IF(OR(AND(d>V_1 B_1,d<V_1 B_2),AND(d>V_2 B_1,d<V_2 B_2),AND(d>V_3 B_1,d<V_3 B_2),AND(d>V_4 B_1,d<V_4 B_2),AND(d>V_5 B_1,d<V_5 B_2),AND(d>V_6 B_1,d<V_6 B_2)),d,0)","v":42195},{"$f":"IF(OR(AND(d>V_1 C_1,d<V_1 C_2),AND(d>V_2 C_1,d<V_2 C_2),AND(d>V_3 C_1,d<V_3 C_2),AND(d>V_4 C_1,d<V_4 C_2),AND(d>V_5 C_1,d<V_5 C_2),AND(d>V_6 C_1,d<V_6 C_2)),d,0)","v":42195},{"$f":"MAX(K16:M16)","v":42195},42195]
[null,null,null,null,null,null,null,null,"2015-07-11",null,{"$f":"IF(OR(AND(d>V_1 A_1,d<V_1 A_2),AND(d>V_2 A_1,d<V_2 A_2),AND(d>V_3 A_1,d<V_3 A_2),AND(d>V_4 A_1,d<V_4 A_2),AND(d>V_5 A_1,d<V_5 A_2),AND(d>V_6 A_1,d<V_6 A_2)),d,0)","v":42196},{"$f":"IF(OR(AND(d>V_1 B_1,d<V_1 B_2),AND(d>V_2 B_1,d<V_2 B_2),AND(d>V_3 B_1,d<V_3 B_2),AND(d>V_4 B_1,d<V_4 B_2),AND(d>V_5 B_1,d<V_5 B_2),AND(d>V_6 B_1,d<V_6 B_2)),d,0)","v":42196},{"$f":"IF(OR(AND(d>V_1 C_1,d<V_1 C_2),AND(d>V_2 C_1,d<V_2 C_2),AND(d>V_3 C_1,d<V_3 C_2),AND(d>V_4 C_1,d<V_4 C_2),AND(d>V_5 C_1,d<V_5 C_2),AND(d>V_6 C_1,d<V_6 C_2)),d,0)","v":42196},42196,42196]
[null,null,null,null,null,null,null,null,"2015-07-12",null,{"$f":"IF(OR(AND(d>V_1 A_1,d<V_1 A_2),AND(d>V_2 A_1,d<V_2 A_2),AND(d>V_3 A_1,d<V_3 A_2),AND(d>V_4 A_1,d<V_4 A_2),AND(d>V_5 A_1,d<V_5 A_2),AND(d>V_6 A_1,d<V_6 A_2)),d,0)","v":42197},{"$f":"IF(OR(AND(d>V_1 B_1,d<V_1 B_2),AND(d>V_2 B_1,d<V_2 B_2),AND(d>V_3 B_1,d<V_3 B_2),AND(d>V_4 B_1,d<V_4 B_2),AND(d>V_5 B_1,d<V_5 B_2),AND(d>V_6 B_1,d<V_6 B_2)),d,0)","v":42197},{"$f":"IF(OR(AND(d>V_1 C_1,d<V_1 C_2),AND(d>V_2 C_1,d<V_2 C_2),AND(d>V_3 C_1,d<V_3 C_2),AND(d>V_4 C_1,d<V_4 C_2),AND(d>V_5 C_1,d<V_5 C_2),AND(d>V_6 C_1,d<V_6 C_2)),d,0)","v":42197},42197,42197]
[null,null,null,null,null,null,null,null,"2015-07-13",null,{"$f":"IF(OR(AND(d>V_1 A_1,d<V_1 A_2),AND(d>V_2 A_1,d<V_2 A_2),AND(d>V_3 A_1,d<V_3 A_2),AND(d>V_4 A_1,d<V_4 A_2),AND(d>V_5 A_1,d<V_5 A_2),AND(d>V_6 A_1,d<V_6 A_2)),d,0)","v":42198},{"$f":"IF(OR(AND(d>V_1 B_1,d<V_1 B_2),AND(d>V_2 B_1,d<V_2 B_2),AND(d>V_3 B_1,d<V_3 B_2),AND(d>V_4 B_1,d<V_4 B_2),AND(d>V_5 B_1,d<V_5 B_2),AND(d>V_6 B_1,d<V_6 B_2)),d,0)","v":42198},{"$f":"IF(OR(AND(d>V_1 C_1,d<V_1 C_2),AND(d>V_2 C_1,d<V_2 C_2),AND(d>V_3 C_1,d<V_3 C_2),AND(d>V_4 C_1,d<V_4 C_2),AND(d>V_5 C_1,d<V_5 C_2),AND(d>V_6 C_1,d<V_6 C_2)),d,0)","v":42198},42198,42198]
[null,null,null,null,null,null,null,null,"2015-07-14",null,{"$f":"IF(OR(AND(d>V_1 A_1,d<V_1 A_2),AND(d>V_2 A_1,d<V_2 A_2),AND(d>V_3 A_1,d<V_3 A_2),AND(d>V_4 A_1,d<V_4 A_2),AND(d>V_5 A_1,d<V_5 A_2),AND(d>V_6 A_1,d<V_6 A_2)),d,0)","v":42199},{"$f":"IF(OR(AND(d>V_1 B_1,d<V_1 B_2),AND(d>V_2 B_1,d<V_2 B_2),AND(d>V_3 B_1,d<V_3 B_2),AND(d>V_4 B_1,d<V_4 B_2),AND(d>V_5 B_1,d<V_5 B_2),AND(d>V_6 B_1,d<V_6 B_2)),d,0)","v":42199},{"$f":"IF(OR(AND(d>V_1 C_1,d<V_1 C_2),AND(d>V_2 C_1,d<V_2 C_2),AND(d>V_3 C_1,d<V_3 C_2),AND(d>V_4 C_1,d<V_4 C_2),AND(d>V_5 C_1,d<V_5 C_2),AND(d>V_6 C_1,d<V_6 C_2)),d,0)","v":42199},42199,42199]
[null,null,null,null,null,null,null,null,"2015-07-15",null,{"$f":"IF(OR(AND(d>V_1 A_1,d<V_1 A_2),AND(d>V_2 A_1,d<V_2 A_2),AND(d>V_3 A_1,d<V_3 A_2),AND(d>V_4 A_1,d<V_4 A_2),AND(d>V_5 A_1,d<V_5 A_2),AND(d>V_6 A_1,d<V_6 A_2)),d,0)","v":42200},{"$f":"IF(OR(AND(d>V_1 B_1,d<V_1 B_2),AND(d>V_2 B_1,d<V_2 B_2),AND(d>V_3 B_1,d<V_3 B_2),AND(d>V_4 B_1,d<V_4 B_2),AND(d>V_5 B_1,d<V_5 B_2),AND(d>V_6 B_1,d<V_6 B_2)),d,0)","v":42200},{"$f":"IF(OR(AND(d>V_1 C_1,d<V_1 C_2),AND(d>V_2 C_1,d<V_2 C_2),AND(d>V_3 C_1,d<V_3 C_2),AND(d>V_4 C_1,d<V_4 C_2),AND(d>V_5 C_1,d<V_5 C_2),AND(d>V_6 C_1,d<V_6 C_2)),d,0)","v":42200},42200,42200]
[null,null,null,null,null,null,null,null,"2015-07-16",null,{"$f":"IF(OR(AND(d>V_1 A_1,d<V_1 A_2),AND(d>V_2 A_1,d<V_2 A_2),AND(d>V_3 A_1,d<V_3 A_2),AND(d>V_4 A_1,d<V_4 A_2),AND(d>V_5 A_1,d<V_5 A_2),AND(d>V_6 A_1,d<V_6 A_2)),d,0)","v":42201},{"$f":"IF(OR(AND(d>V_1 B_1,d<V_1 B_2),AND(d>V_2 B_1,d<V_2 B_2),AND(d>V_3 B_1,d<V_3 B_2),AND(d>V_4 B_1,d<V_4 B_2),AND(d>V_5 B_1,d<V_5 B_2),AND(d>V_6 B_1,d<V_6 B_2)),d,0)","v":42201},{"$f":"IF(OR(AND(d>V_1 C_1,d<V_1 C_2),AND(d>V_2 C_1,d<V_2 C_2),AND(d>V_3 C_1,d<V_3 C_2),AND(d>V_4 C_1,d<V_4 C_2),AND(d>V_5 C_1,d<V_5 C_2),AND(d>V_6 C_1,d<V_6 C_2)),d,0)","v":42201},42201,42201]
[null,null,null,null,null,null,null,null,"2015-07-17",null,{"$f":"IF(OR(AND(d>V_1 A_1,d<V_1 A_2),AND(d>V_2 A_1,d<V_2 A_2),AND(d>V_3 A_1,d<V_3 A_2),AND(d>V_4 A_1,d<V_4 A_2),AND(d>V_5 A_1,d<V_5 A_2),AND(d>V_6 A_1,d<V_6 A_2)),d,0)","v":42202},{"$f":"IF(OR(AND(d>V_1 B_1,d<V_1 B_2),AND(d>V_2 B_1,d<V_2 B_2),AND(d>V_3 B_1,d<V_3 B_2),AND(d>V_4 B_1,d<V_4 B_2),AND(d>V_5 B_1,d<V_5 B_2),AND(d>V_6 B_1,d<V_6 B_2)),d,0)","v":42202},{"$f":"IF(OR(AND(d>V_1 C_1,d<V_1 C_2),AND(d>V_2 C_1,d<V_2 C_2),AND(d>V_3 C_1,d<V_3 C_2),AND(d>V_4 C_1,d<V_4 C_2),AND(d>V_5 C_1,d<V_5 C_2),AND(d>V_6 C_1,d<V_6 C_2)),d,0)","v":42202},42202,42202]
[null,null,null,null,null,null,null,null,"2015-07-18",null,{"$f":"IF(OR(AND(d>V_1 A_1,d<V_1 A_2),AND(d>V_2 A_1,d<V_2 A_2),AND(d>V_3 A_1,d<V_3 A_2),AND(d>V_4 A_1,d<V_4 A_2),AND(d>V_5 A_1,d<V_5 A_2),AND(d>V_6 A_1,d<V_6 A_2)),d,0)","v":42203},{"$f":"IF(OR(AND(d>V_1 B_1,d<V_1 B_2),AND(d>V_2 B_1,d<V_2 B_2),AND(d>V_3 B_1,d<V_3 B_2),AND(d>V_4 B_1,d<V_4 B_2),AND(d>V_5 B_1,d<V_5 B_2),AND(d>V_6 B_1,d<V_6 B_2)),d,0)","v":42203},{"$f":"IF(OR(AND(d>V_1 C_1,d<V_1 C_2),AND(d>V_2 C_1,d<V_2 C_2),AND(d>V_3 C_1,d<V_3 C_2),AND(d>V_4 C_1,d<V_4 C_2),AND(d>V_5 C_1,d<V_5 C_2),AND(d>V_6 C_1,d<V_6 C_2)),d,0)","v":42203},42203,42203]
[null,null,null,null,null,null,null,null,"2015-07-19",null,{"$f":"IF(OR(AND(d>V_1 A_1,d<V_1 A_2),AND(d>V_2 A_1,d<V_2 A_2),AND(d>V_3 A_1,d<V_3 A_2),AND(d>V_4 A_1,d<V_4 A_2),AND(d>V_5 A_1,d<V_5 A_2),AND(d>V_6 A_1,d<V_6 A_2)),d,0)","v":42204},{"$f":"IF(OR(AND(d>V_1 B_1,d<V_1 B_2),AND(d>V_2 B_1,d<V_2 B_2),AND(d>V_3 B_1,d<V_3 B_2),AND(d>V_4 B_1,d<V_4 B_2),AND(d>V_5 B_1,d<V_5 B_2),AND(d>V_6 B_1,d<V_6 B_2)),d,0)","v":42204},{"$f":"IF(OR(AND(d>V_1 C_1,d<V_1 C_2),AND(d>V_2 C_1,d<V_2 C_2),AND(d>V_3 C_1,d<V_3 C_2),AND(d>V_4 C_1,d<V_4 C_2),AND(d>V_5 C_1,d<V_5 C_2),AND(d>V_6 C_1,d<V_6 C_2)),d,0)","v":42204},42204,42204]
[null,null,null,null,null,null,null,null,"2015-07-20",null,{"$f":"IF(OR(AND(d>V_1 A_1,d<V_1 A_2),AND(d>V_2 A_1,d<V_2 A_2),AND(d>V_3 A_1,d<V_3 A_2),AND(d>V_4 A_1,d<V_4 A_2),AND(d>V_5 A_1,d<V_5 A_2),AND(d>V_6 A_1,d<V_6 A_2)),d,0)","v":42205},{"$f":"IF(OR(AND(d>V_1 B_1,d<V_1 B_2),AND(d>V_2 B_1,d<V_2 B_2),AND(d>V_3 B_1,d<V_3 B_2),AND(d>V_4 B_1,d<V_4 B_2),AND(d>V_5 B_1,d<V_5 B_2),AND(d>V_6 B_1,d<V_6 B_2)),d,0)","v":42205},{"$f":"IF(OR(AND(d>V_1 C_1,d<V_1 C_2),AND(d>V_2 C_1,d<V_2 C_2),AND(d>V_3 C_1,d<V_3 C_2),AND(d>V_4 C_1,d<V_4 C_2),AND(d>V_5 C_1,d<V_5 C_2),AND(d>V_6 C_1,d<V_6 C_2)),d,0)","v":42205},42205,42205]
[null,null,null,null,null,null,null,null,"2015-07-21",null,{"$f":"IF(OR(AND(d>V_1 A_1,d<V_1 A_2),AND(d>V_2 A_1,d<V_2 A_2),AND(d>V_3 A_1,d<V_3 A_2),AND(d>V_4 A_1,d<V_4 A_2),AND(d>V_5 A_1,d<V_5 A_2),AND(d>V_6 A_1,d<V_6 A_2)),d,0)","v":42206},{"$f":"IF(OR(AND(d>V_1 B_1,d<V_1 B_2),AND(d>V_2 B_1,d<V_2 B_2),AND(d>V_3 B_1,d<V_3 B_2),AND(d>V_4 B_1,d<V_4 B_2),AND(d>V_5 B_1,d<V_5 B_2),AND(d>V_6 B_1,d<V_6 B_2)),d,0)","v":42206},{"$f":"IF(OR(AND(d>V_1 C_1,d<V_1 C_2),AND(d>V_2 C_1,d<V_2 C_2),AND(d>V_3 C_1,d<V_3 C_2),AND(d>V_4 C_1,d<V_4 C_2),AND(d>V_5 C_1,d<V_5 C_2),AND(d>V_6 C_1,d<V_6 C_2)),d,0)","v":42206},42206,42206]
[null,null,null,null,null,null,null,null,"2015-07-22",null,{"$f":"IF(OR(AND(d>V_1 A_1,d<V_1 A_2),AND(d>V_2 A_1,d<V_2 A_2),AND(d>V_3 A_1,d<V_3 A_2),AND(d>V_4 A_1,d<V_4 A_2),AND(d>V_5 A_1,d<V_5 A_2),AND(d>V_6 A_1,d<V_6 A_2)),d,0)","v":42207},{"$f":"IF(OR(AND(d>V_1 B_1,d<V_1 B_2),AND(d>V_2 B_1,d<V_2 B_2),AND(d>V_3 B_1,d<V_3 B_2),AND(d>V_4 B_1,d<V_4 B_2),AND(d>V_5 B_1,d<V_5 B_2),AND(d>V_6 B_1,d<V_6 B_2)),d,0)","v":42207},{"$f":"IF(OR(AND(d>V_1 C_1,d<V_1 C_2),AND(d>V_2 C_1,d<V_2 C_2),AND(d>V_3 C_1,d<V_3 C_2),AND(d>V_4 C_1,d<V_4 C_2),AND(d>V_5 C_1,d<V_5 C_2),AND(d>V_6 C_1,d<V_6 C_2)),d,0)","v":42207},42207,42207]
[null,null,null,null,null,null,null,null,"2015-07-23",null,{"$f":"IF(OR(AND(d>V_1 A_1,d<V_1 A_2),AND(d>V_2 A_1,d<V_2 A_2),AND(d>V_3 A_1,d<V_3 A_2),AND(d>V_4 A_1,d<V_4 A_2),AND(d>V_5 A_1,d<V_5 A_2),AND(d>V_6 A_1,d<V_6 A_2)),d,0)","v":42208},{"$f":"IF(OR(AND(d>V_1 B_1,d<V_1 B_2),AND(d>V_2 B_1,d<V_2 B_2),AND(d>V_3 B_1,d<V_3 B_2),AND(d>V_4 B_1,d<V_4 B_2),AND(d>V_5 B_1,d<V_5 B_2),AND(d>V_6 B_1,d<V_6 B_2)),d,0)","v":42208},{"$f":"IF(OR(AND(d>V_1 C_1,d<V_1 C_2),AND(d>V_2 C_1,d<V_2 C_2),AND(d>V_3 C_1,d<V_3 C_2),AND(d>V_4 C_1,d<V_4 C_2),AND(d>V_5 C_1,d<V_5 C_2),AND(d>V_6 C_1,d<V_6 C_2)),d,0)","v":42208},42208,42208]
[null,null,null,null,null,null,null,null,"2015-07-24",null,{"$f":"IF(OR(AND(d>V_1 A_1,d<V_1 A_2),AND(d>V_2 A_1,d<V_2 A_2),AND(d>V_3 A_1,d<V_3 A_2),AND(d>V_4 A_1,d<V_4 A_2),AND(d>V_5 A_1,d<V_5 A_2),AND(d>V_6 A_1,d<V_6 A_2)),d,0)","v":42209},{"$f":"IF(OR(AND(d>V_1 B_1,d<V_1 B_2),AND(d>V_2 B_1,d<V_2 B_2),AND(d>V_3 B_1,d<V_3 B_2),AND(d>V_4 B_1,d<V_4 B_2),AND(d>V_5 B_1,d<V_5 B_2),AND(d>V_6 B_1,d<V_6 B_2)),d,0)","v":42209},{"$f":"IF(OR(AND(d>V_1 C_1,d<V_1 C_2),AND(d>V_2 C_1,d<V_2 C_2),AND(d>V_3 C_1,d<V_3 C_2),AND(d>V_4 C_1,d<V_4 C_2),AND(d>V_5 C_1,d<V_5 C_2),AND(d>V_6 C_1,d<V_6 C_2)),d,0)","v":42209},42209,42209]
[null,null,null,null,null,null,null,null,"2015-07-25",null,{"$f":"IF(OR(AND(d>V_1 A_1,d<V_1 A_2),AND(d>V_2 A_1,d<V_2 A_2),AND(d>V_3 A_1,d<V_3 A_2),AND(d>V_4 A_1,d<V_4 A_2),AND(d>V_5 A_1,d<V_5 A_2),AND(d>V_6 A_1,d<V_6 A_2)),d,0)","v":42210},{"$f":"IF(OR(AND(d>V_1 B_1,d<V_1 B_2),AND(d>V_2 B_1,d<V_2 B_2),AND(d>V_3 B_1,d<V_3 B_2),AND(d>V_4 B_1,d<V_4 B_2),AND(d>V_5 B_1,d<V_5 B_2),AND(d>V_6 B_1,d<V_6 B_2)),d,0)","v":42210},{"$f":"IF(OR(AND(d>V_1 C_1,d<V_1 C_2),AND(d>V_2 C_1,d<V_2 C_2),AND(d>V_3 C_1,d<V_3 C_2),AND(d>V_4 C_1,d<V_4 C_2),AND(d>V_5 C_1,d<V_5 C_2),AND(d>V_6 C_1,d<V_6 C_2)),d,0)","v":42210},42210,42210]
[null,null,null,null,null,null,null,null,"2015-07-26",null,{"$f":"IF(OR(AND(d>V_1 A_1,d<V_1 A_2),AND(d>V_2 A_1,d<V_2 A_2),AND(d>V_3 A_1,d<V_3 A_2),AND(d>V_4 A_1,d<V_4 A_2),AND(d>V_5 A_1,d<V_5 A_2),AND(d>V_6 A_1,d<V_6 A_2)),d,0)","v":42211},{"$f":"IF(OR(AND(d>V_1 B_1,d<V_1 B_2),AND(d>V_2 B_1,d<V_2 B_2),AND(d>V_3 B_1,d<V_3 B_2),AND(d>V_4 B_1,d<V_4 B_2),AND(d>V_5 B_1,d<V_5 B_2),AND(d>V_6 B_1,d<V_6 B_2)),d,0)","v":42211},{"$f":"IF(OR(AND(d>V_1 C_1,d<V_1 C_2),AND(d>V_2 C_1,d<V_2 C_2),AND(d>V_3 C_1,d<V_3 C_2),AND(d>V_4 C_1,d<V_4 C_2),AND(d>V_5 C_1,d<V_5 C_2),AND(d>V_6 C_1,d<V_6 C_2)),d,0)","v":42211},42211,42211]
[null,null,null,null,null,null,null,null,"2015-07-27",null,{"$f":"IF(OR(AND(d>V_1 A_1,d<V_1 A_2),AND(d>V_2 A_1,d<V_2 A_2),AND(d>V_3 A_1,d<V_3 A_2),AND(d>V_4 A_1,d<V_4 A_2),AND(d>V_5 A_1,d<V_5 A_2),AND(d>V_6 A_1,d<V_6 A_2)),d,0)","v":42212},{"$f":"IF(OR(AND(d>V_1 B_1,d<V_1 B_2),AND(d>V_2 B_1,d<V_2 B_2),AND(d>V_3 B_1,d<V_3 B_2),AND(d>V_4 B_1,d<V_4 B_2),AND(d>V_5 B_1,d<V_5 B_2),AND(d>V_6 B_1,d<V_6 B_2)),d,0)","v":42212},{"$f":"IF(OR(AND(d>V_1 C_1,d<V_1 C_2),AND(d>V_2 C_1,d<V_2 C_2),AND(d>V_3 C_1,d<V_3 C_2),AND(d>V_4 C_1,d<V_4 C_2),AND(d>V_5 C_1,d<V_5 C_2),AND(d>V_6 C_1,d<V_6 C_2)),d,0)","v":42212},42212,42212]
[null,null,null,null,null,null,null,null,"2015-07-28",null,{"$f":"IF(OR(AND(d>V_1 A_1,d<V_1 A_2),AND(d>V_2 A_1,d<V_2 A_2),AND(d>V_3 A_1,d<V_3 A_2),AND(d>V_4 A_1,d<V_4 A_2),AND(d>V_5 A_1,d<V_5 A_2),AND(d>V_6 A_1,d<V_6 A_2)),d,0)","v":42213},{"$f":"IF(OR(AND(d>V_1 B_1,d<V_1 B_2),AND(d>V_2 B_1,d<V_2 B_2),AND(d>V_3 B_1,d<V_3 B_2),AND(d>V_4 B_1,d<V_4 B_2),AND(d>V_5 B_1,d<V_5 B_2),AND(d>V_6 B_1,d<V_6 B_2)),d,0)","v":42213},{"$f":"IF(OR(AND(d>V_1 C_1,d<V_1 C_2),AND(d>V_2 C_1,d<V_2 C_2),AND(d>V_3 C_1,d<V_3 C_2),AND(d>V_4 C_1,d<V_4 C_2),AND(d>V_5 C_1,d<V_5 C_2),AND(d>V_6 C_1,d<V_6 C_2)),d,0)","v":42213},42213,42213]
[null,null,null,null,null,null,null,null,"2015-07-29",null,{"$f":"IF(OR(AND(d>V_1 A_1,d<V_1 A_2),AND(d>V_2 A_1,d<V_2 A_2),AND(d>V_3 A_1,d<V_3 A_2),AND(d>V_4 A_1,d<V_4 A_2),AND(d>V_5 A_1,d<V_5 A_2),AND(d>V_6 A_1,d<V_6 A_2)),d,0)","v":42214},{"$f":"IF(OR(AND(d>V_1 B_1,d<V_1 B_2),AND(d>V_2 B_1,d<V_2 B_2),AND(d>V_3 B_1,d<V_3 B_2),AND(d>V_4 B_1,d<V_4 B_2),AND(d>V_5 B_1,d<V_5 B_2),AND(d>V_6 B_1,d<V_6 B_2)),d,0)","v":42214},{"$f":"IF(OR(AND(d>V_1 C_1,d<V_1 C_2),AND(d>V_2 C_1,d<V_2 C_2),AND(d>V_3 C_1,d<V_3 C_2),AND(d>V_4 C_1,d<V_4 C_2),AND(d>V_5 C_1,d<V_5 C_2),AND(d>V_6 C_1,d<V_6 C_2)),d,0)","v":42214},42214,42214]
[null,null,null,null,null,null,null,null,"2015-07-30",null,{"$f":"IF(OR(AND(d>V_1 A_1,d<V_1 A_2),AND(d>V_2 A_1,d<V_2 A_2),AND(d>V_3 A_1,d<V_3 A_2),AND(d>V_4 A_1,d<V_4 A_2),AND(d>V_5 A_1,d<V_5 A_2),AND(d>V_6 A_1,d<V_6 A_2)),d,0)","v":42215},{"$f":"IF(OR(AND(d>V_1 B_1,d<V_1 B_2),AND(d>V_2 B_1,d<V_2 B_2),AND(d>V_3 B_1,d<V_3 B_2),AND(d>V_4 B_1,d<V_4 B_2),AND(d>V_5 B_1,d<V_5 B_2),AND(d>V_6 B_1,d<V_6 B_2)),d,0)","v":42215},{"$f":"IF(OR(AND(d>V_1 C_1,d<V_1 C_2),AND(d>V_2 C_1,d<V_2 C_2),AND(d>V_3 C_1,d<V_3 C_2),AND(d>V_4 C_1,d<V_4 C_2),AND(d>V_5 C_1,d<V_5 C_2),AND(d>V_6 C_1,d<V_6 C_2)),d,0)","v":42215},42215,42215]
[null,null,null,null,null,null,null,null,"2015-07-31",null,{"$f":"IF(OR(AND(d>V_1 A_1,d<V_1 A_2),AND(d>V_2 A_1,d<V_2 A_2),AND(d>V_3 A_1,d<V_3 A_2),AND(d>V_4 A_1,d<V_4 A_2),AND(d>V_5 A_1,d<V_5 A_2),AND(d>V_6 A_1,d<V_6 A_2)),d,0)","v":42216},{"$f":"IF(OR(AND(d>V_1 B_1,d<V_1 B_2),AND(d>V_2 B_1,d<V_2 B_2),AND(d>V_3 B_1,d<V_3 B_2),AND(d>V_4 B_1,d<V_4 B_2),AND(d>V_5 B_1,d<V_5 B_2),AND(d>V_6 B_1,d<V_6 B_2)),d,0)","v":42216},{"$f":"IF(OR(AND(d>V_1 C_1,d<V_1 C_2),AND(d>V_2 C_1,d<V_2 C_2),AND(d>V_3 C_1,d<V_3 C_2),AND(d>V_4 C_1,d<V_4 C_2),AND(d>V_5 C_1,d<V_5 C_2),AND(d>V_6 C_1,d<V_6 C_2)),d,0)","v":42216},42216,42216]
[null,null,null,null,null,null,null,null,"2015-08-01",null,{"$f":"IF(OR(AND(d>V_1 A_1,d<V_1 A_2),AND(d>V_2 A_1,d<V_2 A_2),AND(d>V_3 A_1,d<V_3 A_2),AND(d>V_4 A_1,d<V_4 A_2),AND(d>V_5 A_1,d<V_5 A_2),AND(d>V_6 A_1,d<V_6 A_2)),d,0)","v":42217},{"$f":"IF(OR(AND(d>V_1 B_1,d<V_1 B_2),AND(d>V_2 B_1,d<V_2 B_2),AND(d>V_3 B_1,d<V_3 B_2),AND(d>V_4 B_1,d<V_4 B_2),AND(d>V_5 B_1,d<V_5 B_2),AND(d>V_6 B_1,d<V_6 B_2)),d,0)","v":42217},{"$f":"IF(OR(AND(d>V_1 C_1,d<V_1 C_2),AND(d>V_2 C_1,d<V_2 C_2),AND(d>V_3 C_1,d<V_3 C_2),AND(d>V_4 C_1,d<V_4 C_2),AND(d>V_5 C_1,d<V_5 C_2),AND(d>V_6 C_1,d<V_6 C_2)),d,0)","v":42217},42217,42217]
[null,null,null,null,null,null,null,null,"2015-08-02",null,{"$f":"IF(OR(AND(d>V_1 A_1,d<V_1 A_2),AND(d>V_2 A_1,d<V_2 A_2),AND(d>V_3 A_1,d<V_3 A_2),AND(d>V_4 A_1,d<V_4 A_2),AND(d>V_5 A_1,d<V_5 A_2),AND(d>V_6 A_1,d<V_6 A_2)),d,0)","v":42218},{"$f":"IF(OR(AND(d>V_1 B_1,d<V_1 B_2),AND(d>V_2 B_1,d<V_2 B_2),AND(d>V_3 B_1,d<V_3 B_2),AND(d>V_4 B_1,d<V_4 B_2),AND(d>V_5 B_1,d<V_5 B_2),AND(d>V_6 B_1,d<V_6 B_2)),d,0)","v":42218},{"$f":"IF(OR(AND(d>V_1 C_1,d<V_1 C_2),AND(d>V_2 C_1,d<V_2 C_2),AND(d>V_3 C_1,d<V_3 C_2),AND(d>V_4 C_1,d<V_4 C_2),AND(d>V_5 C_1,d<V_5 C_2),AND(d>V_6 C_1,d<V_6 C_2)),d,0)","v":42218},42218,42218]
[null,null,null,null,null,null,null,null,"2015-08-03",null,{"$f":"IF(OR(AND(d>V_1 A_1,d<V_1 A_2),AND(d>V_2 A_1,d<V_2 A_2),AND(d>V_3 A_1,d<V_3 A_2),AND(d>V_4 A_1,d<V_4 A_2),AND(d>V_5 A_1,d<V_5 A_2),AND(d>V_6 A_1,d<V_6 A_2)),d,0)","v":42219},{"$f":"IF(OR(AND(d>V_1 B_1,d<V_1 B_2),AND(d>V_2 B_1,d<V_2 B_2),AND(d>V_3 B_1,d<V_3 B_2),AND(d>V_4 B_1,d<V_4 B_2),AND(d>V_5 B_1,d<V_5 B_2),AND(d>V_6 B_1,d<V_6 B_2)),d,0)","v":42219},{"$f":"IF(OR(AND(d>V_1 C_1,d<V_1 C_2),AND(d>V_2 C_1,d<V_2 C_2),AND(d>V_3 C_1,d<V_3 C_2),AND(d>V_4 C_1,d<V_4 C_2),AND(d>V_5 C_1,d<V_5 C_2),AND(d>V_6 C_1,d<V_6 C_2)),d,0)","v":42219},42219,42219]
[null,null,null,null,null,null,null,null,"2015-08-04",null,{"$f":"IF(OR(AND(d>V_1 A_1,d<V_1 A_2),AND(d>V_2 A_1,d<V_2 A_2),AND(d>V_3 A_1,d<V_3 A_2),AND(d>V_4 A_1,d<V_4 A_2),AND(d>V_5 A_1,d<V_5 A_2),AND(d>V_6 A_1,d<V_6 A_2)),d,0)","v":42220},{"$f":"IF(OR(AND(d>V_1 B_1,d<V_1 B_2),AND(d>V_2 B_1,d<V_2 B_2),AND(d>V_3 B_1,d<V_3 B_2),AND(d>V_4 B_1,d<V_4 B_2),AND(d>V_5 B_1,d<V_5 B_2),AND(d>V_6 B_1,d<V_6 B_2)),d,0)","v":42220},{"$f":"IF(OR(AND(d>V_1 C_1,d<V_1 C_2),AND(d>V_2 C_1,d<V_2 C_2),AND(d>V_3 C_1,d<V_3 C_2),AND(d>V_4 C_1,d<V_4 C_2),AND(d>V_5 C_1,d<V_5 C_2),AND(d>V_6 C_1,d<V_6 C_2)),d,0)","v":42220},42220,42220]
[null,null,null,null,null,null,null,null,"2015-08-05",null,{"$f":"IF(OR(AND(d>V_1 A_1,d<V_1 A_2),AND(d>V_2 A_1,d<V_2 A_2),AND(d>V_3 A_1,d<V_3 A_2),AND(d>V_4 A_1,d<V_4 A_2),AND(d>V_5 A_1,d<V_5 A_2),AND(d>V_6 A_1,d<V_6 A_2)),d,0)","v":42221},{"$f":"IF(OR(AND(d>V_1 B_1,d<V_1 B_2),AND(d>V_2 B_1,d<V_2 B_2),AND(d>V_3 B_1,d<V_3 B_2),AND(d>V_4 B_1,d<V_4 B_2),AND(d>V_5 B_1,d<V_5 B_2),AND(d>V_6 B_1,d<V_6 B_2)),d,0)","v":42221},{"$f":"IF(OR(AND(d>V_1 C_1,d<V_1 C_2),AND(d>V_2 C_1,d<V_2 C_2),AND(d>V_3 C_1,d<V_3 C_2),AND(d>V_4 C_1,d<V_4 C_2),AND(d>V_5 C_1,d<V_5 C_2),AND(d>V_6 C_1,d<V_6 C_2)),d,0)","v":42221},42221,42221]
[null,null,null,null,null,null,null,null,"2015-08-06",null,{"$f":"IF(OR(AND(d>V_1 A_1,d<V_1 A_2),AND(d>V_2 A_1,d<V_2 A_2),AND(d>V_3 A_1,d<V_3 A_2),AND(d>V_4 A_1,d<V_4 A_2),AND(d>V_5 A_1,d<V_5 A_2),AND(d>V_6 A_1,d<V_6 A_2)),d,0)","v":42222},{"$f":"IF(OR(AND(d>V_1 B_1,d<V_1 B_2),AND(d>V_2 B_1,d<V_2 B_2),AND(d>V_3 B_1,d<V_3 B_2),AND(d>V_4 B_1,d<V_4 B_2),AND(d>V_5 B_1,d<V_5 B_2),AND(d>V_6 B_1,d<V_6 B_2)),d,0)","v":42222},{"$f":"IF(OR(AND(d>V_1 C_1,d<V_1 C_2),AND(d>V_2 C_1,d<V_2 C_2),AND(d>V_3 C_1,d<V_3 C_2),AND(d>V_4 C_1,d<V_4 C_2),AND(d>V_5 C_1,d<V_5 C_2),AND(d>V_6 C_1,d<V_6 C_2)),d,0)","v":42222},42222,42222]
[null,null,null,null,null,null,null,null,"2015-08-07",null,{"$f":"IF(OR(AND(d>V_1 A_1,d<V_1 A_2),AND(d>V_2 A_1,d<V_2 A_2),AND(d>V_3 A_1,d<V_3 A_2),AND(d>V_4 A_1,d<V_4 A_2),AND(d>V_5 A_1,d<V_5 A_2),AND(d>V_6 A_1,d<V_6 A_2)),d,0)","v":42223},{"$f":"IF(OR(AND(d>V_1 B_1,d<V_1 B_2),AND(d>V_2 B_1,d<V_2 B_2),AND(d>V_3 B_1,d<V_3 B_2),AND(d>V_4 B_1,d<V_4 B_2),AND(d>V_5 B_1,d<V_5 B_2),AND(d>V_6 B_1,d<V_6 B_2)),d,0)","v":42223},{"$f":"IF(OR(AND(d>V_1 C_1,d<V_1 C_2),AND(d>V_2 C_1,d<V_2 C_2),AND(d>V_3 C_1,d<V_3 C_2),AND(d>V_4 C_1,d<V_4 C_2),AND(d>V_5 C_1,d<V_5 C_2),AND(d>V_6 C_1,d<V_6 C_2)),d,0)","v":42223},42223,42223]
[null,null,null,null,null,null,null,null,"2015-08-08",null,{"$f":"IF(OR(AND(d>V_1 A_1,d<V_1 A_2),AND(d>V_2 A_1,d<V_2 A_2),AND(d>V_3 A_1,d<V_3 A_2),AND(d>V_4 A_1,d<V_4 A_2),AND(d>V_5 A_1,d<V_5 A_2),AND(d>V_6 A_1,d<V_6 A_2)),d,0)","v":42224},{"$f":"IF(OR(AND(d>V_1 B_1,d<V_1 B_2),AND(d>V_2 B_1,d<V_2 B_2),AND(d>V_3 B_1,d<V_3 B_2),AND(d>V_4 B_1,d<V_4 B_2),AND(d>V_5 B_1,d<V_5 B_2),AND(d>V_6 B_1,d<V_6 B_2)),d,0)","v":42224},{"$f":"IF(OR(AND(d>V_1 C_1,d<V_1 C_2),AND(d>V_2 C_1,d<V_2 C_2),AND(d>V_3 C_1,d<V_3 C_2),AND(d>V_4 C_1,d<V_4 C_2),AND(d>V_5 C_1,d<V_5 C_2),AND(d>V_6 C_1,d<V_6 C_2)),d,0)","v":42224},42224,42224]
[null,null,null,null,null,null,null,null,"2015-08-09",null,{"$f":"IF(OR(AND(d>V_1 A_1,d<V_1 A_2),AND(d>V_2 A_1,d<V_2 A_2),AND(d>V_3 A_1,d<V_3 A_2),AND(d>V_4 A_1,d<V_4 A_2),AND(d>V_5 A_1,d<V_5 A_2),AND(d>V_6 A_1,d<V_6 A_2)),d,0)","v":42225},{"$f":"IF(OR(AND(d>V_1 B_1,d<V_1 B_2),AND(d>V_2 B_1,d<V_2 B_2),AND(d>V_3 B_1,d<V_3 B_2),AND(d>V_4 B_1,d<V_4 B_2),AND(d>V_5 B_1,d<V_5 B_2),AND(d>V_6 B_1,d<V_6 B_2)),d,0)","v":42225},{"$f":"IF(OR(AND(d>V_1 C_1,d<V_1 C_2),AND(d>V_2 C_1,d<V_2 C_2),AND(d>V_3 C_1,d<V_3 C_2),AND(d>V_4 C_1,d<V_4 C_2),AND(d>V_5 C_1,d<V_5 C_2),AND(d>V_6 C_1,d<V_6 C_2)),d,0)","v":42225},42225,42225]
[null,null,null,null,null,null,null,null,"2015-08-10",null,{"$f":"IF(OR(AND(d>V_1 A_1,d<V_1 A_2),AND(d>V_2 A_1,d<V_2 A_2),AND(d>V_3 A_1,d<V_3 A_2),AND(d>V_4 A_1,d<V_4 A_2),AND(d>V_5 A_1,d<V_5 A_2),AND(d>V_6 A_1,d<V_6 A_2)),d,0)","v":42226},{"$f":"IF(OR(AND(d>V_1 B_1,d<V_1 B_2),AND(d>V_2 B_1,d<V_2 B_2),AND(d>V_3 B_1,d<V_3 B_2),AND(d>V_4 B_1,d<V_4 B_2),AND(d>V_5 B_1,d<V_5 B_2),AND(d>V_6 B_1,d<V_6 B_2)),d,0)","v":42226},{"$f":"IF(OR(AND(d>V_1 C_1,d<V_1 C_2),AND(d>V_2 C_1,d<V_2 C_2),AND(d>V_3 C_1,d<V_3 C_2),AND(d>V_4 C_1,d<V_4 C_2),AND(d>V_5 C_1,d<V_5 C_2),AND(d>V_6 C_1,d<V_6 C_2)),d,0)","v":42226},42226,42226]
[null,null,null,null,null,null,null,null,"2015-08-11",null,{"$f":"IF(OR(AND(d>V_1 A_1,d<V_1 A_2),AND(d>V_2 A_1,d<V_2 A_2),AND(d>V_3 A_1,d<V_3 A_2),AND(d>V_4 A_1,d<V_4 A_2),AND(d>V_5 A_1,d<V_5 A_2),AND(d>V_6 A_1,d<V_6 A_2)),d,0)","v":42227},{"$f":"IF(OR(AND(d>V_1 B_1,d<V_1 B_2),AND(d>V_2 B_1,d<V_2 B_2),AND(d>V_3 B_1,d<V_3 B_2),AND(d>V_4 B_1,d<V_4 B_2),AND(d>V_5 B_1,d<V_5 B_2),AND(d>V_6 B_1,d<V_6 B_2)),d,0)","v":42227},{"$f":"IF(OR(AND(d>V_1 C_1,d<V_1 C_2),AND(d>V_2 C_1,d<V_2 C_2),AND(d>V_3 C_1,d<V_3 C_2),AND(d>V_4 C_1,d<V_4 C_2),AND(d>V_5 C_1,d<V_5 C_2),AND(d>V_6 C_1,d<V_6 C_2)),d,0)","v":42227},42227,42227]
[null,null,null,null,null,null,null,null,"2015-08-12",null,{"$f":"IF(OR(AND(d>V_1 A_1,d<V_1 A_2),AND(d>V_2 A_1,d<V_2 A_2),AND(d>V_3 A_1,d<V_3 A_2),AND(d>V_4 A_1,d<V_4 A_2),AND(d>V_5 A_1,d<V_5 A_2),AND(d>V_6 A_1,d<V_6 A_2)),d,0)","v":42228},{"$f":"IF(OR(AND(d>V_1 B_1,d<V_1 B_2),AND(d>V_2 B_1,d<V_2 B_2),AND(d>V_3 B_1,d<V_3 B_2),AND(d>V_4 B_1,d<V_4 B_2),AND(d>V_5 B_1,d<V_5 B_2),AND(d>V_6 B_1,d<V_6 B_2)),d,0)","v":42228},{"$f":"IF(OR(AND(d>V_1 C_1,d<V_1 C_2),AND(d>V_2 C_1,d<V_2 C_2),AND(d>V_3 C_1,d<V_3 C_2),AND(d>V_4 C_1,d<V_4 C_2),AND(d>V_5 C_1,d<V_5 C_2),AND(d>V_6 C_1,d<V_6 C_2)),d,0)","v":42228},42228,42228]
[null,null,null,null,null,null,null,null,"2015-08-13",null,{"$f":"IF(OR(AND(d>V_1 A_1,d<V_1 A_2),AND(d>V_2 A_1,d<V_2 A_2),AND(d>V_3 A_1,d<V_3 A_2),AND(d>V_4 A_1,d<V_4 A_2),AND(d>V_5 A_1,d<V_5 A_2),AND(d>V_6 A_1,d<V_6 A_2)),d,0)","v":42229},{"$f":"IF(OR(AND(d>V_1 B_1,d<V_1 B_2),AND(d>V_2 B_1,d<V_2 B_2),AND(d>V_3 B_1,d<V_3 B_2),AND(d>V_4 B_1,d<V_4 B_2),AND(d>V_5 B_1,d<V_5 B_2),AND(d>V_6 B_1,d<V_6 B_2)),d,0)","v":42229},{"$f":"IF(OR(AND(d>V_1 C_1,d<V_1 C_2),AND(d>V_2 C_1,d<V_2 C_2),AND(d>V_3 C_1,d<V_3 C_2),AND(d>V_4 C_1,d<V_4 C_2),AND(d>V_5 C_1,d<V_5 C_2),AND(d>V_6 C_1,d<V_6 C_2)),d,0)","v":42229},42229,42229]
[null,null,null,null,null,null,null,null,"2015-08-14",null,{"$f":"IF(OR(AND(d>V_1 A_1,d<V_1 A_2),AND(d>V_2 A_1,d<V_2 A_2),AND(d>V_3 A_1,d<V_3 A_2),AND(d>V_4 A_1,d<V_4 A_2),AND(d>V_5 A_1,d<V_5 A_2),AND(d>V_6 A_1,d<V_6 A_2)),d,0)","v":42230},{"$f":"IF(OR(AND(d>V_1 B_1,d<V_1 B_2),AND(d>V_2 B_1,d<V_2 B_2),AND(d>V_3 B_1,d<V_3 B_2),AND(d>V_4 B_1,d<V_4 B_2),AND(d>V_5 B_1,d<V_5 B_2),AND(d>V_6 B_1,d<V_6 B_2)),d,0)","v":42230},{"$f":"IF(OR(AND(d>V_1 C_1,d<V_1 C_2),AND(d>V_2 C_1,d<V_2 C_2),AND(d>V_3 C_1,d<V_3 C_2),AND(d>V_4 C_1,d<V_4 C_2),AND(d>V_5 C_1,d<V_5 C_2),AND(d>V_6 C_1,d<V_6 C_2)),d,0)","v":42230},42230,42230]
[null,null,null,null,null,null,null,null,"2015-08-15",null,{"$f":"IF(OR(AND(d>V_1 A_1,d<V_1 A_2),AND(d>V_2 A_1,d<V_2 A_2),AND(d>V_3 A_1,d<V_3 A_2),AND(d>V_4 A_1,d<V_4 A_2),AND(d>V_5 A_1,d<V_5 A_2),AND(d>V_6 A_1,d<V_6 A_2)),d,0)","v":42231},{"$f":"IF(OR(AND(d>V_1 B_1,d<V_1 B_2),AND(d>V_2 B_1,d<V_2 B_2),AND(d>V_3 B_1,d<V_3 B_2),AND(d>V_4 B_1,d<V_4 B_2),AND(d>V_5 B_1,d<V_5 B_2),AND(d>V_6 B_1,d<V_6 B_2)),d,0)","v":42231},{"$f":"IF(OR(AND(d>V_1 C_1,d<V_1 C_2),AND(d>V_2 C_1,d<V_2 C_2),AND(d>V_3 C_1,d<V_3 C_2),AND(d>V_4 C_1,d<V_4 C_2),AND(d>V_5 C_1,d<V_5 C_2),AND(d>V_6 C_1,d<V_6 C_2)),d,0)","v":42231},42231,42231]
[null,null,null,null,null,null,null,null,"2015-08-16",null,{"$f":"IF(OR(AND(d>V_1 A_1,d<V_1 A_2),AND(d>V_2 A_1,d<V_2 A_2),AND(d>V_3 A_1,d<V_3 A_2),AND(d>V_4 A_1,d<V_4 A_2),AND(d>V_5 A_1,d<V_5 A_2),AND(d>V_6 A_1,d<V_6 A_2)),d,0)","v":42232},{"$f":"IF(OR(AND(d>V_1 B_1,d<V_1 B_2),AND(d>V_2 B_1,d<V_2 B_2),AND(d>V_3 B_1,d<V_3 B_2),AND(d>V_4 B_1,d<V_4 B_2),AND(d>V_5 B_1,d<V_5 B_2),AND(d>V_6 B_1,d<V_6 B_2)),d,0)","v":42232},{"$f":"IF(OR(AND(d>V_1 C_1,d<V_1 C_2),AND(d>V_2 C_1,d<V_2 C_2),AND(d>V_3 C_1,d<V_3 C_2),AND(d>V_4 C_1,d<V_4 C_2),AND(d>V_5 C_1,d<V_5 C_2),AND(d>V_6 C_1,d<V_6 C_2)),d,0)","v":42232},42232,42232]
[null,null,null,null,null,null,null,null,"2015-08-17",null,{"$f":"IF(OR(AND(d>V_1 A_1,d<V_1 A_2),AND(d>V_2 A_1,d<V_2 A_2),AND(d>V_3 A_1,d<V_3 A_2),AND(d>V_4 A_1,d<V_4 A_2),AND(d>V_5 A_1,d<V_5 A_2),AND(d>V_6 A_1,d<V_6 A_2)),d,0)","v":42233},{"$f":"IF(OR(AND(d>V_1 B_1,d<V_1 B_2),AND(d>V_2 B_1,d<V_2 B_2),AND(d>V_3 B_1,d<V_3 B_2),AND(d>V_4 B_1,d<V_4 B_2),AND(d>V_5 B_1,d<V_5 B_2),AND(d>V_6 B_1,d<V_6 B_2)),d,0)","v":42233},{"$f":"IF(OR(AND(d>V_1 C_1,d<V_1 C_2),AND(d>V_2 C_1,d<V_2 C_2),AND(d>V_3 C_1,d<V_3 C_2),AND(d>V_4 C_1,d<V_4 C_2),AND(d>V_5 C_1,d<V_5 C_2),AND(d>V_6 C_1,d<V_6 C_2)),d,0)","v":42233},42233,42233]
[null,null,null,null,null,null,null,null,"2015-08-18",null,{"$f":"IF(OR(AND(d>V_1 A_1,d<V_1 A_2),AND(d>V_2 A_1,d<V_2 A_2),AND(d>V_3 A_1,d<V_3 A_2),AND(d>V_4 A_1,d<V_4 A_2),AND(d>V_5 A_1,d<V_5 A_2),AND(d>V_6 A_1,d<V_6 A_2)),d,0)","v":42234},{"$f":"IF(OR(AND(d>V_1 B_1,d<V_1 B_2),AND(d>V_2 B_1,d<V_2 B_2),AND(d>V_3 B_1,d<V_3 B_2),AND(d>V_4 B_1,d<V_4 B_2),AND(d>V_5 B_1,d<V_5 B_2),AND(d>V_6 B_1,d<V_6 B_2)),d,0)","v":42234},{"$f":"IF(OR(AND(d>V_1 C_1,d<V_1 C_2),AND(d>V_2 C_1,d<V_2 C_2),AND(d>V_3 C_1,d<V_3 C_2),AND(d>V_4 C_1,d<V_4 C_2),AND(d>V_5 C_1,d<V_5 C_2),AND(d>V_6 C_1,d<V_6 C_2)),d,0)","v":42234},42234,42234]
[null,null,null,null,null,null,null,null,"2015-08-19",null,{"$f":"IF(OR(AND(d>V_1 A_1,d<V_1 A_2),AND(d>V_2 A_1,d<V_2 A_2),AND(d>V_3 A_1,d<V_3 A_2),AND(d>V_4 A_1,d<V_4 A_2),AND(d>V_5 A_1,d<V_5 A_2),AND(d>V_6 A_1,d<V_6 A_2)),d,0)","v":42235},{"$f":"IF(OR(AND(d>V_1 B_1,d<V_1 B_2),AND(d>V_2 B_1,d<V_2 B_2),AND(d>V_3 B_1,d<V_3 B_2),AND(d>V_4 B_1,d<V_4 B_2),AND(d>V_5 B_1,d<V_5 B_2),AND(d>V_6 B_1,d<V_6 B_2)),d,0)","v":42235},{"$f":"IF(OR(AND(d>V_1 C_1,d<V_1 C_2),AND(d>V_2 C_1,d<V_2 C_2),AND(d>V_3 C_1,d<V_3 C_2),AND(d>V_4 C_1,d<V_4 C_2),AND(d>V_5 C_1,d<V_5 C_2),AND(d>V_6 C_1,d<V_6 C_2)),d,0)","v":42235},42235,42235]
[null,null,null,null,null,null,null,null,"2015-08-20",null,{"$f":"IF(OR(AND(d>V_1 A_1,d<V_1 A_2),AND(d>V_2 A_1,d<V_2 A_2),AND(d>V_3 A_1,d<V_3 A_2),AND(d>V_4 A_1,d<V_4 A_2),AND(d>V_5 A_1,d<V_5 A_2),AND(d>V_6 A_1,d<V_6 A_2)),d,0)","v":42236},{"$f":"IF(OR(AND(d>V_1 B_1,d<V_1 B_2),AND(d>V_2 B_1,d<V_2 B_2),AND(d>V_3 B_1,d<V_3 B_2),AND(d>V_4 B_1,d<V_4 B_2),AND(d>V_5 B_1,d<V_5 B_2),AND(d>V_6 B_1,d<V_6 B_2)),d,0)","v":42236},{"$f":"IF(OR(AND(d>V_1 C_1,d<V_1 C_2),AND(d>V_2 C_1,d<V_2 C_2),AND(d>V_3 C_1,d<V_3 C_2),AND(d>V_4 C_1,d<V_4 C_2),AND(d>V_5 C_1,d<V_5 C_2),AND(d>V_6 C_1,d<V_6 C_2)),d,0)","v":42236},42236,42236]
[null,null,null,null,null,null,null,null,"2015-08-21",null,{"$f":"IF(OR(AND(d>V_1 A_1,d<V_1 A_2),AND(d>V_2 A_1,d<V_2 A_2),AND(d>V_3 A_1,d<V_3 A_2),AND(d>V_4 A_1,d<V_4 A_2),AND(d>V_5 A_1,d<V_5 A_2),AND(d>V_6 A_1,d<V_6 A_2)),d,0)","v":42237},{"$f":"IF(OR(AND(d>V_1 B_1,d<V_1 B_2),AND(d>V_2 B_1,d<V_2 B_2),AND(d>V_3 B_1,d<V_3 B_2),AND(d>V_4 B_1,d<V_4 B_2),AND(d>V_5 B_1,d<V_5 B_2),AND(d>V_6 B_1,d<V_6 B_2)),d,0)","v":42237},{"$f":"IF(OR(AND(d>V_1 C_1,d<V_1 C_2),AND(d>V_2 C_1,d<V_2 C_2),AND(d>V_3 C_1,d<V_3 C_2),AND(d>V_4 C_1,d<V_4 C_2),AND(d>V_5 C_1,d<V_5 C_2),AND(d>V_6 C_1,d<V_6 C_2)),d,0)","v":42237},42237,42237]
[null,null,null,null,null,null,null,null,"2015-08-22",null,{"$f":"IF(OR(AND(d>V_1 A_1,d<V_1 A_2),AND(d>V_2 A_1,d<V_2 A_2),AND(d>V_3 A_1,d<V_3 A_2),AND(d>V_4 A_1,d<V_4 A_2),AND(d>V_5 A_1,d<V_5 A_2),AND(d>V_6 A_1,d<V_6 A_2)),d,0)","v":42238},{"$f":"IF(OR(AND(d>V_1 B_1,d<V_1 B_2),AND(d>V_2 B_1,d<V_2 B_2),AND(d>V_3 B_1,d<V_3 B_2),AND(d>V_4 B_1,d<V_4 B_2),AND(d>V_5 B_1,d<V_5 B_2),AND(d>V_6 B_1,d<V_6 B_2)),d,0)","v":42238},{"$f":"IF(OR(AND(d>V_1 C_1,d<V_1 C_2),AND(d>V_2 C_1,d<V_2 C_2),AND(d>V_3 C_1,d<V_3 C_2),AND(d>V_4 C_1,d<V_4 C_2),AND(d>V_5 C_1,d<V_5 C_2),AND(d>V_6 C_1,d<V_6 C_2)),d,0)","v":42238},42238,42238]
[null,null,null,null,null,null,null,null,"2015-08-23",null,{"$f":"IF(OR(AND(d>V_1 A_1,d<V_1 A_2),AND(d>V_2 A_1,d<V_2 A_2),AND(d>V_3 A_1,d<V_3 A_2),AND(d>V_4 A_1,d<V_4 A_2),AND(d>V_5 A_1,d<V_5 A_2),AND(d>V_6 A_1,d<V_6 A_2)),d,0)","v":42239},{"$f":"IF(OR(AND(d>V_1 B_1,d<V_1 B_2),AND(d>V_2 B_1,d<V_2 B_2),AND(d>V_3 B_1,d<V_3 B_2),AND(d>V_4 B_1,d<V_4 B_2),AND(d>V_5 B_1,d<V_5 B_2),AND(d>V_6 B_1,d<V_6 B_2)),d,0)","v":42239},{"$f":"IF(OR(AND(d>V_1 C_1,d<V_1 C_2),AND(d>V_2 C_1,d<V_2 C_2),AND(d>V_3 C_1,d<V_3 C_2),AND(d>V_4 C_1,d<V_4 C_2),AND(d>V_5 C_1,d<V_5 C_2),AND(d>V_6 C_1,d<V_6 C_2)),d,0)","v":42239},42239,42239]
[null,null,null,null,null,null,null,null,"2015-08-24",null,{"$f":"IF(OR(AND(d>V_1 A_1,d<V_1 A_2),AND(d>V_2 A_1,d<V_2 A_2),AND(d>V_3 A_1,d<V_3 A_2),AND(d>V_4 A_1,d<V_4 A_2),AND(d>V_5 A_1,d<V_5 A_2),AND(d>V_6 A_1,d<V_6 A_2)),d,0)","v":42240},{"$f":"IF(OR(AND(d>V_1 B_1,d<V_1 B_2),AND(d>V_2 B_1,d<V_2 B_2),AND(d>V_3 B_1,d<V_3 B_2),AND(d>V_4 B_1,d<V_4 B_2),AND(d>V_5 B_1,d<V_5 B_2),AND(d>V_6 B_1,d<V_6 B_2)),d,0)","v":42240},{"$f":"IF(OR(AND(d>V_1 C_1,d<V_1 C_2),AND(d>V_2 C_1,d<V_2 C_2),AND(d>V_3 C_1,d<V_3 C_2),AND(d>V_4 C_1,d<V_4 C_2),AND(d>V_5 C_1,d<V_5 C_2),AND(d>V_6 C_1,d<V_6 C_2)),d,0)","v":42240},42240,42240]
[null,null,null,null,null,null,null,null,"2015-08-25",null,{"$f":"IF(OR(AND(d>V_1 A_1,d<V_1 A_2),AND(d>V_2 A_1,d<V_2 A_2),AND(d>V_3 A_1,d<V_3 A_2),AND(d>V_4 A_1,d<V_4 A_2),AND(d>V_5 A_1,d<V_5 A_2),AND(d>V_6 A_1,d<V_6 A_2)),d,0)","v":42241},{"$f":"IF(OR(AND(d>V_1 B_1,d<V_1 B_2),AND(d>V_2 B_1,d<V_2 B_2),AND(d>V_3 B_1,d<V_3 B_2),AND(d>V_4 B_1,d<V_4 B_2),AND(d>V_5 B_1,d<V_5 B_2),AND(d>V_6 B_1,d<V_6 B_2)),d,0)","v":42241},{"$f":"IF(OR(AND(d>V_1 C_1,d<V_1 C_2),AND(d>V_2 C_1,d<V_2 C_2),AND(d>V_3 C_1,d<V_3 C_2),AND(d>V_4 C_1,d<V_4 C_2),AND(d>V_5 C_1,d<V_5 C_2),AND(d>V_6 C_1,d<V_6 C_2)),d,0)","v":42241},42241,42241]
[null,null,null,null,null,null,null,null,"2015-08-26",null,{"$f":"IF(OR(AND(d>V_1 A_1,d<V_1 A_2),AND(d>V_2 A_1,d<V_2 A_2),AND(d>V_3 A_1,d<V_3 A_2),AND(d>V_4 A_1,d<V_4 A_2),AND(d>V_5 A_1,d<V_5 A_2),AND(d>V_6 A_1,d<V_6 A_2)),d,0)","v":42242},{"$f":"IF(OR(AND(d>V_1 B_1,d<V_1 B_2),AND(d>V_2 B_1,d<V_2 B_2),AND(d>V_3 B_1,d<V_3 B_2),AND(d>V_4 B_1,d<V_4 B_2),AND(d>V_5 B_1,d<V_5 B_2),AND(d>V_6 B_1,d<V_6 B_2)),d,0)","v":42242},{"$f":"IF(OR(AND(d>V_1 C_1,d<V_1 C_2),AND(d>V_2 C_1,d<V_2 C_2),AND(d>V_3 C_1,d<V_3 C_2),AND(d>V_4 C_1,d<V_4 C_2),AND(d>V_5 C_1,d<V_5 C_2),AND(d>V_6 C_1,d<V_6 C_2)),d,0)","v":42242},42242,42242]
[null,null,null,null,null,null,null,null,"2015-08-27",null,{"$f":"IF(OR(AND(d>V_1 A_1,d<V_1 A_2),AND(d>V_2 A_1,d<V_2 A_2),AND(d>V_3 A_1,d<V_3 A_2),AND(d>V_4 A_1,d<V_4 A_2),AND(d>V_5 A_1,d<V_5 A_2),AND(d>V_6 A_1,d<V_6 A_2)),d,0)","v":42243},{"$f":"IF(OR(AND(d>V_1 B_1,d<V_1 B_2),AND(d>V_2 B_1,d<V_2 B_2),AND(d>V_3 B_1,d<V_3 B_2),AND(d>V_4 B_1,d<V_4 B_2),AND(d>V_5 B_1,d<V_5 B_2),AND(d>V_6 B_1,d<V_6 B_2)),d,0)","v":42243},{"$f":"IF(OR(AND(d>V_1 C_1,d<V_1 C_2),AND(d>V_2 C_1,d<V_2 C_2),AND(d>V_3 C_1,d<V_3 C_2),AND(d>V_4 C_1,d<V_4 C_2),AND(d>V_5 C_1,d<V_5 C_2),AND(d>V_6 C_1,d<V_6 C_2)),d,0)","v":42243},42243,42243]
[null,null,null,null,null,null,null,null,"2015-08-28",null,{"$f":"IF(OR(AND(d>V_1 A_1,d<V_1 A_2),AND(d>V_2 A_1,d<V_2 A_2),AND(d>V_3 A_1,d<V_3 A_2),AND(d>V_4 A_1,d<V_4 A_2),AND(d>V_5 A_1,d<V_5 A_2),AND(d>V_6 A_1,d<V_6 A_2)),d,0)","v":42244},{"$f":"IF(OR(AND(d>V_1 B_1,d<V_1 B_2),AND(d>V_2 B_1,d<V_2 B_2),AND(d>V_3 B_1,d<V_3 B_2),AND(d>V_4 B_1,d<V_4 B_2),AND(d>V_5 B_1,d<V_5 B_2),AND(d>V_6 B_1,d<V_6 B_2)),d,0)","v":42244},{"$f":"IF(OR(AND(d>V_1 C_1,d<V_1 C_2),AND(d>V_2 C_1,d<V_2 C_2),AND(d>V_3 C_1,d<V_3 C_2),AND(d>V_4 C_1,d<V_4 C_2),AND(d>V_5 C_1,d<V_5 C_2),AND(d>V_6 C_1,d<V_6 C_2)),d,0)","v":42244},42244,42244]
[null,null,null,null,null,null,null,null,"2015-08-29",null,{"$f":"IF(OR(AND(d>V_1 A_1,d<V_1 A_2),AND(d>V_2 A_1,d<V_2 A_2),AND(d>V_3 A_1,d<V_3 A_2),AND(d>V_4 A_1,d<V_4 A_2),AND(d>V_5 A_1,d<V_5 A_2),AND(d>V_6 A_1,d<V_6 A_2)),d,0)","v":42245},{"$f":"IF(OR(AND(d>V_1 B_1,d<V_1 B_2),AND(d>V_2 B_1,d<V_2 B_2),AND(d>V_3 B_1,d<V_3 B_2),AND(d>V_4 B_1,d<V_4 B_2),AND(d>V_5 B_1,d<V_5 B_2),AND(d>V_6 B_1,d<V_6 B_2)),d,0)","v":42245},{"$f":"IF(OR(AND(d>V_1 C_1,d<V_1 C_2),AND(d>V_2 C_1,d<V_2 C_2),AND(d>V_3 C_1,d<V_3 C_2),AND(d>V_4 C_1,d<V_4 C_2),AND(d>V_5 C_1,d<V_5 C_2),AND(d>V_6 C_1,d<V_6 C_2)),d,0)","v":42245},42245,42245]
[null,null,null,null,null,null,null,null,"2015-08-30",null,{"$f":"IF(OR(AND(d>V_1 A_1,d<V_1 A_2),AND(d>V_2 A_1,d<V_2 A_2),AND(d>V_3 A_1,d<V_3 A_2),AND(d>V_4 A_1,d<V_4 A_2),AND(d>V_5 A_1,d<V_5 A_2),AND(d>V_6 A_1,d<V_6 A_2)),d,0)","v":42246},{"$f":"IF(OR(AND(d>V_1 B_1,d<V_1 B_2),AND(d>V_2 B_1,d<V_2 B_2),AND(d>V_3 B_1,d<V_3 B_2),AND(d>V_4 B_1,d<V_4 B_2),AND(d>V_5 B_1,d<V_5 B_2),AND(d>V_6 B_1,d<V_6 B_2)),d,0)","v":42246},{"$f":"IF(OR(AND(d>V_1 C_1,d<V_1 C_2),AND(d>V_2 C_1,d<V_2 C_2),AND(d>V_3 C_1,d<V_3 C_2),AND(d>V_4 C_1,d<V_4 C_2),AND(d>V_5 C_1,d<V_5 C_2),AND(d>V_6 C_1,d<V_6 C_2)),d,0)","v":42246},42246,42246]
[null,null,null,null,null,null,null,null,"2015-08-31",null,{"$f":"IF(OR(AND(d>V_1 A_1,d<V_1 A_2),AND(d>V_2 A_1,d<V_2 A_2),AND(d>V_3 A_1,d<V_3 A_2),AND(d>V_4 A_1,d<V_4 A_2),AND(d>V_5 A_1,d<V_5 A_2),AND(d>V_6 A_1,d<V_6 A_2)),d,0)","v":0},{"$f":"IF(OR(AND(d>V_1 B_1,d<V_1 B_2),AND(d>V_2 B_1,d<V_2 B_2),AND(d>V_3 B_1,d<V_3 B_2),AND(d>V_4 B_1,d<V_4 B_2),AND(d>V_5 B_1,d<V_5 B_2),AND(d>V_6 B_1,d<V_6 B_2)),d,0)","v":0},{"$f":"IF(OR(AND(d>V_1 C_1,d<V_1 C_2),AND(d>V_2 C_1,d<V_2 C_2),AND(d>V_3 C_1,d<V_3 C_2),AND(d>V_4 C_1,d<V_4 C_2),AND(d>V_5 C_1,d<V_5 C_2),AND(d>V_6 C_1,d<V_6 C_2)),d,0)","v":0},0,0]
[null,null,null,null,null,null,null,null,"2015-09-01",null,{"$f":"IF(OR(AND(d>V_1 A_1,d<V_1 A_2),AND(d>V_2 A_1,d<V_2 A_2),AND(d>V_3 A_1,d<V_3 A_2),AND(d>V_4 A_1,d<V_4 A_2),AND(d>V_5 A_1,d<V_5 A_2),AND(d>V_6 A_1,d<V_6 A_2)),d,0)","v":0},{"$f":"IF(OR(AND(d>V_1 B_1,d<V_1 B_2),AND(d>V_2 B_1,d<V_2 B_2),AND(d>V_3 B_1,d<V_3 B_2),AND(d>V_4 B_1,d<V_4 B_2),AND(d>V_5 B_1,d<V_5 B_2),AND(d>V_6 B_1,d<V_6 B_2)),d,0)","v":0},{"$f":"IF(OR(AND(d>V_1 C_1,d<V_1 C_2),AND(d>V_2 C_1,d<V_2 C_2),AND(d>V_3 C_1,d<V_3 C_2),AND(d>V_4 C_1,d<V_4 C_2),AND(d>V_5 C_1,d<V_5 C_2),AND(d>V_6 C_1,d<V_6 C_2)),d,0)","v":0},0,0]
[null,null,null,null,null,null,null,null,"2015-09-02",null,{"$f":"IF(OR(AND(d>V_1 A_1,d<V_1 A_2),AND(d>V_2 A_1,d<V_2 A_2),AND(d>V_3 A_1,d<V_3 A_2),AND(d>V_4 A_1,d<V_4 A_2),AND(d>V_5 A_1,d<V_5 A_2),AND(d>V_6 A_1,d<V_6 A_2)),d,0)","v":0},{"$f":"IF(OR(AND(d>V_1 B_1,d<V_1 B_2),AND(d>V_2 B_1,d<V_2 B_2),AND(d>V_3 B_1,d<V_3 B_2),AND(d>V_4 B_1,d<V_4 B_2),AND(d>V_5 B_1,d<V_5 B_2),AND(d>V_6 B_1,d<V_6 B_2)),d,0)","v":0},{"$f":"IF(OR(AND(d>V_1 C_1,d<V_1 C_2),AND(d>V_2 C_1,d<V_2 C_2),AND(d>V_3 C_1,d<V_3 C_2),AND(d>V_4 C_1,d<V_4 C_2),AND(d>V_5 C_1,d<V_5 C_2),AND(d>V_6 C_1,d<V_6 C_2)),d,0)","v":0},0,0]
[null,null,null,null,null,null,null,null,"2015-09-03",null,{"$f":"IF(OR(AND(d>V_1 A_1,d<V_1 A_2),AND(d>V_2 A_1,d<V_2 A_2),AND(d>V_3 A_1,d<V_3 A_2),AND(d>V_4 A_1,d<V_4 A_2),AND(d>V_5 A_1,d<V_5 A_2),AND(d>V_6 A_1,d<V_6 A_2)),d,0)","v":0},{"$f":"IF(OR(AND(d>V_1 B_1,d<V_1 B_2),AND(d>V_2 B_1,d<V_2 B_2),AND(d>V_3 B_1,d<V_3 B_2),AND(d>V_4 B_1,d<V_4 B_2),AND(d>V_5 B_1,d<V_5 B_2),AND(d>V_6 B_1,d<V_6 B_2)),d,0)","v":0},{"$f":"IF(OR(AND(d>V_1 C_1,d<V_1 C_2),AND(d>V_2 C_1,d<V_2 C_2),AND(d>V_3 C_1,d<V_3 C_2),AND(d>V_4 C_1,d<V_4 C_2),AND(d>V_5 C_1,d<V_5 C_2),AND(d>V_6 C_1,d<V_6 C_2)),d,0)","v":0},0,0]
[null,null,null,null,null,null,null,null,"2015-09-04",null,{"$f":"IF(OR(AND(d>V_1 A_1,d<V_1 A_2),AND(d>V_2 A_1,d<V_2 A_2),AND(d>V_3 A_1,d<V_3 A_2),AND(d>V_4 A_1,d<V_4 A_2),AND(d>V_5 A_1,d<V_5 A_2),AND(d>V_6 A_1,d<V_6 A_2)),d,0)","v":0},{"$f":"IF(OR(AND(d>V_1 B_1,d<V_1 B_2),AND(d>V_2 B_1,d<V_2 B_2),AND(d>V_3 B_1,d<V_3 B_2),AND(d>V_4 B_1,d<V_4 B_2),AND(d>V_5 B_1,d<V_5 B_2),AND(d>V_6 B_1,d<V_6 B_2)),d,0)","v":0},{"$f":"IF(OR(AND(d>V_1 C_1,d<V_1 C_2),AND(d>V_2 C_1,d<V_2 C_2),AND(d>V_3 C_1,d<V_3 C_2),AND(d>V_4 C_1,d<V_4 C_2),AND(d>V_5 C_1,d<V_5 C_2),AND(d>V_6 C_1,d<V_6 C_2)),d,0)","v":0},0,0]
[null,null,null,null,null,null,null,null,"2015-09-05",null,{"$f":"IF(OR(AND(d>V_1 A_1,d<V_1 A_2),AND(d>V_2 A_1,d<V_2 A_2),AND(d>V_3 A_1,d<V_3 A_2),AND(d>V_4 A_1,d<V_4 A_2),AND(d>V_5 A_1,d<V_5 A_2),AND(d>V_6 A_1,d<V_6 A_2)),d,0)","v":0},{"$f":"IF(OR(AND(d>V_1 B_1,d<V_1 B_2),AND(d>V_2 B_1,d<V_2 B_2),AND(d>V_3 B_1,d<V_3 B_2),AND(d>V_4 B_1,d<V_4 B_2),AND(d>V_5 B_1,d<V_5 B_2),AND(d>V_6 B_1,d<V_6 B_2)),d,0)","v":0},{"$f":"IF(OR(AND(d>V_1 C_1,d<V_1 C_2),AND(d>V_2 C_1,d<V_2 C_2),AND(d>V_3 C_1,d<V_3 C_2),AND(d>V_4 C_1,d<V_4 C_2),AND(d>V_5 C_1,d<V_5 C_2),AND(d>V_6 C_1,d<V_6 C_2)),d,0)","v":0},0,0]
[null,null,null,null,null,null,null,null,"2015-09-06",null,{"$f":"IF(OR(AND(d>V_1 A_1,d<V_1 A_2),AND(d>V_2 A_1,d<V_2 A_2),AND(d>V_3 A_1,d<V_3 A_2),AND(d>V_4 A_1,d<V_4 A_2),AND(d>V_5 A_1,d<V_5 A_2),AND(d>V_6 A_1,d<V_6 A_2)),d,0)","v":0},{"$f":"IF(OR(AND(d>V_1 B_1,d<V_1 B_2),AND(d>V_2 B_1,d<V_2 B_2),AND(d>V_3 B_1,d<V_3 B_2),AND(d>V_4 B_1,d<V_4 B_2),AND(d>V_5 B_1,d<V_5 B_2),AND(d>V_6 B_1,d<V_6 B_2)),d,0)","v":0},{"$f":"IF(OR(AND(d>V_1 C_1,d<V_1 C_2),AND(d>V_2 C_1,d<V_2 C_2),AND(d>V_3 C_1,d<V_3 C_2),AND(d>V_4 C_1,d<V_4 C_2),AND(d>V_5 C_1,d<V_5 C_2),AND(d>V_6 C_1,d<V_6 C_2)),d,0)","v":0},0,{"$f":"INDEX(J74:N74,choix_zone)","v":0}]
[null,null,null,null,null,null,null,null,"2015-09-07",null,{"$f":"IF(OR(AND(d>V_1 A_1,d<V_1 A_2),AND(d>V_2 A_1,d<V_2 A_2),AND(d>V_3 A_1,d<V_3 A_2),AND(d>V_4 A_1,d<V_4 A_2),AND(d>V_5 A_1,d<V_5 A_2),AND(d>V_6 A_1,d<V_6 A_2)),d,0)","v":0},{"$f":"IF(OR(AND(d>V_1 B_1,d<V_1 B_2),AND(d>V_2 B_1,d<V_2 B_2),AND(d>V_3 B_1,d<V_3 B_2),AND(d>V_4 B_1,d<V_4 B_2),AND(d>V_5 B_1,d<V_5 B_2),AND(d>V_6 B_1,d<V_6 B_2)),d,0)","v":0},{"$f":"IF(OR(AND(d>V_1 C_1,d<V_1 C_2),AND(d>V_2 C_1,d<V_2 C_2),AND(d>V_3 C_1,d<V_3 C_2),AND(d>V_4 C_1,d<V_4 C_2),AND(d>V_5 C_1,d<V_5 C_2),AND(d>V_6 C_1,d<V_6 C_2)),d,0)","v":0},0,0]
[null,null,null,null,null,null,null,null,{"$f":"I75+1","v":"2015-09-08"},null,{"$f":"IF(OR(AND(d>V_1 A_1,d<V_1 A_2),AND(d>V_2 A_1,d<V_2 A_2),AND(d>V_3 A_1,d<V_3 A_2),AND(d>V_4 A_1,d<V_4 A_2),AND(d>V_5 A_1,d<V_5 A_2),AND(d>V_6 A_1,d<V_6 A_2)),d,0)","v":0},{"$f":"IF(OR(AND(d>V_1 B_1,d<V_1 B_2),AND(d>V_2 B_1,d<V_2 B_2),AND(d>V_3 B_1,d<V_3 B_2),AND(d>V_4 B_1,d<V_4 B_2),AND(d>V_5 B_1,d<V_5 B_2),AND(d>V_6 B_1,d<V_6 B_2)),d,0)","v":0},{"$f":"IF(OR(AND(d>V_1 C_1,d<V_1 C_2),AND(d>V_2 C_1,d<V_2 C_2),AND(d>V_3 C_1,d<V_3 C_2),AND(d>V_4 C_1,d<V_4 C_2),AND(d>V_5 C_1,d<V_5 C_2),AND(d>V_6 C_1,d<V_6 C_2)),d,0)","v":0},0,0]
[null,null,null,null,null,null,null,null,"2015-09-09",null,{"$f":"IF(OR(AND(d>V_1 A_1,d<V_1 A_2),AND(d>V_2 A_1,d<V_2 A_2),AND(d>V_3 A_1,d<V_3 A_2),AND(d>V_4 A_1,d<V_4 A_2),AND(d>V_5 A_1,d<V_5 A_2),AND(d>V_6 A_1,d<V_6 A_2)),d,0)","v":0},{"$f":"IF(OR(AND(d>V_1 B_1,d<V_1 B_2),AND(d>V_2 B_1,d<V_2 B_2),AND(d>V_3 B_1,d<V_3 B_2),AND(d>V_4 B_1,d<V_4 B_2),AND(d>V_5 B_1,d<V_5 B_2),AND(d>V_6 B_1,d<V_6 B_2)),d,0)","v":0},{"$f":"IF(OR(AND(d>V_1 C_1,d<V_1 C_2),AND(d>V_2 C_1,d<V_2 C_2),AND(d>V_3 C_1,d<V_3 C_2),AND(d>V_4 C_1,d<V_4 C_2),AND(d>V_5 C_1,d<V_5 C_2),AND(d>V_6 C_1,d<V_6 C_2)),d,0)","v":0},0,0]
[null,null,null,null,null,null,null,null,"2015-09-10",null,{"$f":"IF(OR(AND(d>V_1 A_1,d<V_1 A_2),AND(d>V_2 A_1,d<V_2 A_2),AND(d>V_3 A_1,d<V_3 A_2),AND(d>V_4 A_1,d<V_4 A_2),AND(d>V_5 A_1,d<V_5 A_2),AND(d>V_6 A_1,d<V_6 A_2)),d,0)","v":0},{"$f":"IF(OR(AND(d>V_1 B_1,d<V_1 B_2),AND(d>V_2 B_1,d<V_2 B_2),AND(d>V_3 B_1,d<V_3 B_2),AND(d>V_4 B_1,d<V_4 B_2),AND(d>V_5 B_1,d<V_5 B_2),AND(d>V_6 B_1,d<V_6 B_2)),d,0)","v":0},{"$f":"IF(OR(AND(d>V_1 C_1,d<V_1 C_2),AND(d>V_2 C_1,d<V_2 C_2),AND(d>V_3 C_1,d<V_3 C_2),AND(d>V_4 C_1,d<V_4 C_2),AND(d>V_5 C_1,d<V_5 C_2),AND(d>V_6 C_1,d<V_6 C_2)),d,0)","v":0},0,0]
[null,null,null,null,null,null,null,null,"2015-09-11",null,{"$f":"IF(OR(AND(d>V_1 A_1,d<V_1 A_2),AND(d>V_2 A_1,d<V_2 A_2),AND(d>V_3 A_1,d<V_3 A_2),AND(d>V_4 A_1,d<V_4 A_2),AND(d>V_5 A_1,d<V_5 A_2),AND(d>V_6 A_1,d<V_6 A_2)),d,0)","v":0},{"$f":"IF(OR(AND(d>V_1 B_1,d<V_1 B_2),AND(d>V_2 B_1,d<V_2 B_2),AND(d>V_3 B_1,d<V_3 B_2),AND(d>V_4 B_1,d<V_4 B_2),AND(d>V_5 B_1,d<V_5 B_2),AND(d>V_6 B_1,d<V_6 B_2)),d,0)","v":0},{"$f":"IF(OR(AND(d>V_1 C_1,d<V_1 C_2),AND(d>V_2 C_1,d<V_2 C_2),AND(d>V_3 C_1,d<V_3 C_2),AND(d>V_4 C_1,d<V_4 C_2),AND(d>V_5 C_1,d<V_5 C_2),AND(d>V_6 C_1,d<V_6 C_2)),d,0)","v":0},0,0]
[null,null,null,null,null,null,null,null,"2015-09-12",null,{"$f":"IF(OR(AND(d>V_1 A_1,d<V_1 A_2),AND(d>V_2 A_1,d<V_2 A_2),AND(d>V_3 A_1,d<V_3 A_2),AND(d>V_4 A_1,d<V_4 A_2),AND(d>V_5 A_1,d<V_5 A_2),AND(d>V_6 A_1,d<V_6 A_2)),d,0)","v":0},{"$f":"IF(OR(AND(d>V_1 B_1,d<V_1 B_2),AND(d>V_2 B_1,d<V_2 B_2),AND(d>V_3 B_1,d<V_3 B_2),AND(d>V_4 B_1,d<V_4 B_2),AND(d>V_5 B_1,d<V_5 B_2),AND(d>V_6 B_1,d<V_6 B_2)),d,0)","v":0},{"$f":"IF(OR(AND(d>V_1 C_1,d<V_1 C_2),AND(d>V_2 C_1,d<V_2 C_2),AND(d>V_3 C_1,d<V_3 C_2),AND(d>V_4 C_1,d<V_4 C_2),AND(d>V_5 C_1,d<V_5 C_2),AND(d>V_6 C_1,d<V_6 C_2)),d,0)","v":0},{"$f":"MAX(K80:M80)","v":0},0]
[null,null,null,null,null,null,null,null,"2015-09-13",null,{"$f":"IF(OR(AND(d>V_1 A_1,d<V_1 A_2),AND(d>V_2 A_1,d<V_2 A_2),AND(d>V_3 A_1,d<V_3 A_2),AND(d>V_4 A_1,d<V_4 A_2),AND(d>V_5 A_1,d<V_5 A_2),AND(d>V_6 A_1,d<V_6 A_2)),d,0)","v":0},{"$f":"IF(OR(AND(d>V_1 B_1,d<V_1 B_2),AND(d>V_2 B_1,d<V_2 B_2),AND(d>V_3 B_1,d<V_3 B_2),AND(d>V_4 B_1,d<V_4 B_2),AND(d>V_5 B_1,d<V_5 B_2),AND(d>V_6 B_1,d<V_6 B_2)),d,0)","v":0},{"$f":"IF(OR(AND(d>V_1 C_1,d<V_1 C_2),AND(d>V_2 C_1,d<V_2 C_2),AND(d>V_3 C_1,d<V_3 C_2),AND(d>V_4 C_1,d<V_4 C_2),AND(d>V_5 C_1,d<V_5 C_2),AND(d>V_6 C_1,d<V_6 C_2)),d,0)","v":0},0,0]
[null,null,null,null,null,null,null,null,"2015-09-14",null,{"$f":"IF(OR(AND(d>V_1 A_1,d<V_1 A_2),AND(d>V_2 A_1,d<V_2 A_2),AND(d>V_3 A_1,d<V_3 A_2),AND(d>V_4 A_1,d<V_4 A_2),AND(d>V_5 A_1,d<V_5 A_2),AND(d>V_6 A_1,d<V_6 A_2)),d,0)","v":0},{"$f":"IF(OR(AND(d>V_1 B_1,d<V_1 B_2),AND(d>V_2 B_1,d<V_2 B_2),AND(d>V_3 B_1,d<V_3 B_2),AND(d>V_4 B_1,d<V_4 B_2),AND(d>V_5 B_1,d<V_5 B_2),AND(d>V_6 B_1,d<V_6 B_2)),d,0)","v":0},{"$f":"IF(OR(AND(d>V_1 C_1,d<V_1 C_2),AND(d>V_2 C_1,d<V_2 C_2),AND(d>V_3 C_1,d<V_3 C_2),AND(d>V_4 C_1,d<V_4 C_2),AND(d>V_5 C_1,d<V_5 C_2),AND(d>V_6 C_1,d<V_6 C_2)),d,0)","v":0},0,0]
[null,null,null,null,null,null,null,null,"2015-09-15",null,{"$f":"IF(OR(AND(d>V_1 A_1,d<V_1 A_2),AND(d>V_2 A_1,d<V_2 A_2),AND(d>V_3 A_1,d<V_3 A_2),AND(d>V_4 A_1,d<V_4 A_2),AND(d>V_5 A_1,d<V_5 A_2),AND(d>V_6 A_1,d<V_6 A_2)),d,0)","v":0},{"$f":"IF(OR(AND(d>V_1 B_1,d<V_1 B_2),AND(d>V_2 B_1,d<V_2 B_2),AND(d>V_3 B_1,d<V_3 B_2),AND(d>V_4 B_1,d<V_4 B_2),AND(d>V_5 B_1,d<V_5 B_2),AND(d>V_6 B_1,d<V_6 B_2)),d,0)","v":0},{"$f":"IF(OR(AND(d>V_1 C_1,d<V_1 C_2),AND(d>V_2 C_1,d<V_2 C_2),AND(d>V_3 C_1,d<V_3 C_2),AND(d>V_4 C_1,d<V_4 C_2),AND(d>V_5 C_1,d<V_5 C_2),AND(d>V_6 C_1,d<V_6 C_2)),d,0)","v":0},0,0]
[null,null,null,null,null,null,null,null,"2015-09-16",null,{"$f":"IF(OR(AND(d>V_1 A_1,d<V_1 A_2),AND(d>V_2 A_1,d<V_2 A_2),AND(d>V_3 A_1,d<V_3 A_2),AND(d>V_4 A_1,d<V_4 A_2),AND(d>V_5 A_1,d<V_5 A_2),AND(d>V_6 A_1,d<V_6 A_2)),d,0)","v":0},{"$f":"IF(OR(AND(d>V_1 B_1,d<V_1 B_2),AND(d>V_2 B_1,d<V_2 B_2),AND(d>V_3 B_1,d<V_3 B_2),AND(d>V_4 B_1,d<V_4 B_2),AND(d>V_5 B_1,d<V_5 B_2),AND(d>V_6 B_1,d<V_6 B_2)),d,0)","v":0},{"$f":"IF(OR(AND(d>V_1 C_1,d<V_1 C_2),AND(d>V_2 C_1,d<V_2 C_2),AND(d>V_3 C_1,d<V_3 C_2),AND(d>V_4 C_1,d<V_4 C_2),AND(d>V_5 C_1,d<V_5 C_2),AND(d>V_6 C_1,d<V_6 C_2)),d,0)","v":0},0,0]
[null,null,null,null,null,null,null,null,"2015-09-17",null,{"$f":"IF(OR(AND(d>V_1 A_1,d<V_1 A_2),AND(d>V_2 A_1,d<V_2 A_2),AND(d>V_3 A_1,d<V_3 A_2),AND(d>V_4 A_1,d<V_4 A_2),AND(d>V_5 A_1,d<V_5 A_2),AND(d>V_6 A_1,d<V_6 A_2)),d,0)","v":0},{"$f":"IF(OR(AND(d>V_1 B_1,d<V_1 B_2),AND(d>V_2 B_1,d<V_2 B_2),AND(d>V_3 B_1,d<V_3 B_2),AND(d>V_4 B_1,d<V_4 B_2),AND(d>V_5 B_1,d<V_5 B_2),AND(d>V_6 B_1,d<V_6 B_2)),d,0)","v":0},{"$f":"IF(OR(AND(d>V_1 C_1,d<V_1 C_2),AND(d>V_2 C_1,d<V_2 C_2),AND(d>V_3 C_1,d<V_3 C_2),AND(d>V_4 C_1,d<V_4 C_2),AND(d>V_5 C_1,d<V_5 C_2),AND(d>V_6 C_1,d<V_6 C_2)),d,0)","v":0},0,0]
[null,null,null,null,null,null,null,null,"2015-09-18",null,{"$f":"IF(OR(AND(d>V_1 A_1,d<V_1 A_2),AND(d>V_2 A_1,d<V_2 A_2),AND(d>V_3 A_1,d<V_3 A_2),AND(d>V_4 A_1,d<V_4 A_2),AND(d>V_5 A_1,d<V_5 A_2),AND(d>V_6 A_1,d<V_6 A_2)),d,0)","v":0},{"$f":"IF(OR(AND(d>V_1 B_1,d<V_1 B_2),AND(d>V_2 B_1,d<V_2 B_2),AND(d>V_3 B_1,d<V_3 B_2),AND(d>V_4 B_1,d<V_4 B_2),AND(d>V_5 B_1,d<V_5 B_2),AND(d>V_6 B_1,d<V_6 B_2)),d,0)","v":0},{"$f":"IF(OR(AND(d>V_1 C_1,d<V_1 C_2),AND(d>V_2 C_1,d<V_2 C_2),AND(d>V_3 C_1,d<V_3 C_2),AND(d>V_4 C_1,d<V_4 C_2),AND(d>V_5 C_1,d<V_5 C_2),AND(d>V_6 C_1,d<V_6 C_2)),d,0)","v":0},0,0]
[null,null,null,null,null,null,null,null,"2015-09-19",null,{"$f":"IF(OR(AND(d>V_1 A_1,d<V_1 A_2),AND(d>V_2 A_1,d<V_2 A_2),AND(d>V_3 A_1,d<V_3 A_2),AND(d>V_4 A_1,d<V_4 A_2),AND(d>V_5 A_1,d<V_5 A_2),AND(d>V_6 A_1,d<V_6 A_2)),d,0)","v":0},{"$f":"IF(OR(AND(d>V_1 B_1,d<V_1 B_2),AND(d>V_2 B_1,d<V_2 B_2),AND(d>V_3 B_1,d<V_3 B_2),AND(d>V_4 B_1,d<V_4 B_2),AND(d>V_5 B_1,d<V_5 B_2),AND(d>V_6 B_1,d<V_6 B_2)),d,0)","v":0},{"$f":"IF(OR(AND(d>V_1 C_1,d<V_1 C_2),AND(d>V_2 C_1,d<V_2 C_2),AND(d>V_3 C_1,d<V_3 C_2),AND(d>V_4 C_1,d<V_4 C_2),AND(d>V_5 C_1,d<V_5 C_2),AND(d>V_6 C_1,d<V_6 C_2)),d,0)","v":0},0,0]
[null,null,null,null,null,null,null,null,"2015-09-20",null,{"$f":"IF(OR(AND(d>V_1 A_1,d<V_1 A_2),AND(d>V_2 A_1,d<V_2 A_2),AND(d>V_3 A_1,d<V_3 A_2),AND(d>V_4 A_1,d<V_4 A_2),AND(d>V_5 A_1,d<V_5 A_2),AND(d>V_6 A_1,d<V_6 A_2)),d,0)","v":0},{"$f":"IF(OR(AND(d>V_1 B_1,d<V_1 B_2),AND(d>V_2 B_1,d<V_2 B_2),AND(d>V_3 B_1,d<V_3 B_2),AND(d>V_4 B_1,d<V_4 B_2),AND(d>V_5 B_1,d<V_5 B_2),AND(d>V_6 B_1,d<V_6 B_2)),d,0)","v":0},{"$f":"IF(OR(AND(d>V_1 C_1,d<V_1 C_2),AND(d>V_2 C_1,d<V_2 C_2),AND(d>V_3 C_1,d<V_3 C_2),AND(d>V_4 C_1,d<V_4 C_2),AND(d>V_5 C_1,d<V_5 C_2),AND(d>V_6 C_1,d<V_6 C_2)),d,0)","v":0},0,0]
[null,null,null,null,null,null,null,null,"2015-09-21",null,{"$f":"IF(OR(AND(d>V_1 A_1,d<V_1 A_2),AND(d>V_2 A_1,d<V_2 A_2),AND(d>V_3 A_1,d<V_3 A_2),AND(d>V_4 A_1,d<V_4 A_2),AND(d>V_5 A_1,d<V_5 A_2),AND(d>V_6 A_1,d<V_6 A_2)),d,0)","v":0},{"$f":"IF(OR(AND(d>V_1 B_1,d<V_1 B_2),AND(d>V_2 B_1,d<V_2 B_2),AND(d>V_3 B_1,d<V_3 B_2),AND(d>V_4 B_1,d<V_4 B_2),AND(d>V_5 B_1,d<V_5 B_2),AND(d>V_6 B_1,d<V_6 B_2)),d,0)","v":0},{"$f":"IF(OR(AND(d>V_1 C_1,d<V_1 C_2),AND(d>V_2 C_1,d<V_2 C_2),AND(d>V_3 C_1,d<V_3 C_2),AND(d>V_4 C_1,d<V_4 C_2),AND(d>V_5 C_1,d<V_5 C_2),AND(d>V_6 C_1,d<V_6 C_2)),d,0)","v":0},0,0]
[null,null,null,null,null,null,null,null,"2015-09-22",null,{"$f":"IF(OR(AND(d>V_1 A_1,d<V_1 A_2),AND(d>V_2 A_1,d<V_2 A_2),AND(d>V_3 A_1,d<V_3 A_2),AND(d>V_4 A_1,d<V_4 A_2),AND(d>V_5 A_1,d<V_5 A_2),AND(d>V_6 A_1,d<V_6 A_2)),d,0)","v":0},{"$f":"IF(OR(AND(d>V_1 B_1,d<V_1 B_2),AND(d>V_2 B_1,d<V_2 B_2),AND(d>V_3 B_1,d<V_3 B_2),AND(d>V_4 B_1,d<V_4 B_2),AND(d>V_5 B_1,d<V_5 B_2),AND(d>V_6 B_1,d<V_6 B_2)),d,0)","v":0},{"$f":"IF(OR(AND(d>V_1 C_1,d<V_1 C_2),AND(d>V_2 C_1,d<V_2 C_2),AND(d>V_3 C_1,d<V_3 C_2),AND(d>V_4 C_1,d<V_4 C_2),AND(d>V_5 C_1,d<V_5 C_2),AND(d>V_6 C_1,d<V_6 C_2)),d,0)","v":0},0,0]
[null,null,null,null,null,null,null,null,"2015-09-23",null,{"$f":"IF(OR(AND(d>V_1 A_1,d<V_1 A_2),AND(d>V_2 A_1,d<V_2 A_2),AND(d>V_3 A_1,d<V_3 A_2),AND(d>V_4 A_1,d<V_4 A_2),AND(d>V_5 A_1,d<V_5 A_2),AND(d>V_6 A_1,d<V_6 A_2)),d,0)","v":0},{"$f":"IF(OR(AND(d>V_1 B_1,d<V_1 B_2),AND(d>V_2 B_1,d<V_2 B_2),AND(d>V_3 B_1,d<V_3 B_2),AND(d>V_4 B_1,d<V_4 B_2),AND(d>V_5 B_1,d<V_5 B_2),AND(d>V_6 B_1,d<V_6 B_2)),d,0)","v":0},{"$f":"IF(OR(AND(d>V_1 C_1,d<V_1 C_2),AND(d>V_2 C_1,d<V_2 C_2),AND(d>V_3 C_1,d<V_3 C_2),AND(d>V_4 C_1,d<V_4 C_2),AND(d>V_5 C_1,d<V_5 C_2),AND(d>V_6 C_1,d<V_6 C_2)),d,0)","v":0},0,0]
[null,null,null,null,null,null,null,null,"2015-09-24",null,{"$f":"IF(OR(AND(d>V_1 A_1,d<V_1 A_2),AND(d>V_2 A_1,d<V_2 A_2),AND(d>V_3 A_1,d<V_3 A_2),AND(d>V_4 A_1,d<V_4 A_2),AND(d>V_5 A_1,d<V_5 A_2),AND(d>V_6 A_1,d<V_6 A_2)),d,0)","v":0},{"$f":"IF(OR(AND(d>V_1 B_1,d<V_1 B_2),AND(d>V_2 B_1,d<V_2 B_2),AND(d>V_3 B_1,d<V_3 B_2),AND(d>V_4 B_1,d<V_4 B_2),AND(d>V_5 B_1,d<V_5 B_2),AND(d>V_6 B_1,d<V_6 B_2)),d,0)","v":0},{"$f":"IF(OR(AND(d>V_1 C_1,d<V_1 C_2),AND(d>V_2 C_1,d<V_2 C_2),AND(d>V_3 C_1,d<V_3 C_2),AND(d>V_4 C_1,d<V_4 C_2),AND(d>V_5 C_1,d<V_5 C_2),AND(d>V_6 C_1,d<V_6 C_2)),d,0)","v":0},0,0]
[null,null,null,null,null,null,null,null,"2015-09-25",null,{"$f":"IF(OR(AND(d>V_1 A_1,d<V_1 A_2),AND(d>V_2 A_1,d<V_2 A_2),AND(d>V_3 A_1,d<V_3 A_2),AND(d>V_4 A_1,d<V_4 A_2),AND(d>V_5 A_1,d<V_5 A_2),AND(d>V_6 A_1,d<V_6 A_2)),d,0)","v":0},{"$f":"IF(OR(AND(d>V_1 B_1,d<V_1 B_2),AND(d>V_2 B_1,d<V_2 B_2),AND(d>V_3 B_1,d<V_3 B_2),AND(d>V_4 B_1,d<V_4 B_2),AND(d>V_5 B_1,d<V_5 B_2),AND(d>V_6 B_1,d<V_6 B_2)),d,0)","v":0},{"$f":"IF(OR(AND(d>V_1 C_1,d<V_1 C_2),AND(d>V_2 C_1,d<V_2 C_2),AND(d>V_3 C_1,d<V_3 C_2),AND(d>V_4 C_1,d<V_4 C_2),AND(d>V_5 C_1,d<V_5 C_2),AND(d>V_6 C_1,d<V_6 C_2)),d,0)","v":0},0,0]
[null,null,null,null,null,null,null,null,"2015-09-26",null,{"$f":"IF(OR(AND(d>V_1 A_1,d<V_1 A_2),AND(d>V_2 A_1,d<V_2 A_2),AND(d>V_3 A_1,d<V_3 A_2),AND(d>V_4 A_1,d<V_4 A_2),AND(d>V_5 A_1,d<V_5 A_2),AND(d>V_6 A_1,d<V_6 A_2)),d,0)","v":0},{"$f":"IF(OR(AND(d>V_1 B_1,d<V_1 B_2),AND(d>V_2 B_1,d<V_2 B_2),AND(d>V_3 B_1,d<V_3 B_2),AND(d>V_4 B_1,d<V_4 B_2),AND(d>V_5 B_1,d<V_5 B_2),AND(d>V_6 B_1,d<V_6 B_2)),d,0)","v":0},{"$f":"IF(OR(AND(d>V_1 C_1,d<V_1 C_2),AND(d>V_2 C_1,d<V_2 C_2),AND(d>V_3 C_1,d<V_3 C_2),AND(d>V_4 C_1,d<V_4 C_2),AND(d>V_5 C_1,d<V_5 C_2),AND(d>V_6 C_1,d<V_6 C_2)),d,0)","v":0},0,0]
[null,null,null,null,null,null,null,null,"2015-09-27",null,{"$f":"IF(OR(AND(d>V_1 A_1,d<V_1 A_2),AND(d>V_2 A_1,d<V_2 A_2),AND(d>V_3 A_1,d<V_3 A_2),AND(d>V_4 A_1,d<V_4 A_2),AND(d>V_5 A_1,d<V_5 A_2),AND(d>V_6 A_1,d<V_6 A_2)),d,0)","v":0},{"$f":"IF(OR(AND(d>V_1 B_1,d<V_1 B_2),AND(d>V_2 B_1,d<V_2 B_2),AND(d>V_3 B_1,d<V_3 B_2),AND(d>V_4 B_1,d<V_4 B_2),AND(d>V_5 B_1,d<V_5 B_2),AND(d>V_6 B_1,d<V_6 B_2)),d,0)","v":0},{"$f":"IF(OR(AND(d>V_1 C_1,d<V_1 C_2),AND(d>V_2 C_1,d<V_2 C_2),AND(d>V_3 C_1,d<V_3 C_2),AND(d>V_4 C_1,d<V_4 C_2),AND(d>V_5 C_1,d<V_5 C_2),AND(d>V_6 C_1,d<V_6 C_2)),d,0)","v":0},0,0]
[null,null,null,null,null,null,null,null,"2015-09-28",null,{"$f":"IF(OR(AND(d>V_1 A_1,d<V_1 A_2),AND(d>V_2 A_1,d<V_2 A_2),AND(d>V_3 A_1,d<V_3 A_2),AND(d>V_4 A_1,d<V_4 A_2),AND(d>V_5 A_1,d<V_5 A_2),AND(d>V_6 A_1,d<V_6 A_2)),d,0)","v":0},{"$f":"IF(OR(AND(d>V_1 B_1,d<V_1 B_2),AND(d>V_2 B_1,d<V_2 B_2),AND(d>V_3 B_1,d<V_3 B_2),AND(d>V_4 B_1,d<V_4 B_2),AND(d>V_5 B_1,d<V_5 B_2),AND(d>V_6 B_1,d<V_6 B_2)),d,0)","v":0},{"$f":"IF(OR(AND(d>V_1 C_1,d<V_1 C_2),AND(d>V_2 C_1,d<V_2 C_2),AND(d>V_3 C_1,d<V_3 C_2),AND(d>V_4 C_1,d<V_4 C_2),AND(d>V_5 C_1,d<V_5 C_2),AND(d>V_6 C_1,d<V_6 C_2)),d,0)","v":0},0,0]
[null,null,null,null,null,null,null,null,"2015-09-29",null,{"$f":"IF(OR(AND(d>V_1 A_1,d<V_1 A_2),AND(d>V_2 A_1,d<V_2 A_2),AND(d>V_3 A_1,d<V_3 A_2),AND(d>V_4 A_1,d<V_4 A_2),AND(d>V_5 A_1,d<V_5 A_2),AND(d>V_6 A_1,d<V_6 A_2)),d,0)","v":0},{"$f":"IF(OR(AND(d>V_1 B_1,d<V_1 B_2),AND(d>V_2 B_1,d<V_2 B_2),AND(d>V_3 B_1,d<V_3 B_2),AND(d>V_4 B_1,d<V_4 B_2),AND(d>V_5 B_1,d<V_5 B_2),AND(d>V_6 B_1,d<V_6 B_2)),d,0)","v":0},{"$f":"IF(OR(AND(d>V_1 C_1,d<V_1 C_2),AND(d>V_2 C_1,d<V_2 C_2),AND(d>V_3 C_1,d<V_3 C_2),AND(d>V_4 C_1,d<V_4 C_2),AND(d>V_5 C_1,d<V_5 C_2),AND(d>V_6 C_1,d<V_6 C_2)),d,0)","v":0},0,0]
[null,null,null,null,null,null,null,null,"2015-09-30",null,{"$f":"IF(OR(AND(d>V_1 A_1,d<V_1 A_2),AND(d>V_2 A_1,d<V_2 A_2),AND(d>V_3 A_1,d<V_3 A_2),AND(d>V_4 A_1,d<V_4 A_2),AND(d>V_5 A_1,d<V_5 A_2),AND(d>V_6 A_1,d<V_6 A_2)),d,0)","v":0},{"$f":"IF(OR(AND(d>V_1 B_1,d<V_1 B_2),AND(d>V_2 B_1,d<V_2 B_2),AND(d>V_3 B_1,d<V_3 B_2),AND(d>V_4 B_1,d<V_4 B_2),AND(d>V_5 B_1,d<V_5 B_2),AND(d>V_6 B_1,d<V_6 B_2)),d,0)","v":0},{"$f":"IF(OR(AND(d>V_1 C_1,d<V_1 C_2),AND(d>V_2 C_1,d<V_2 C_2),AND(d>V_3 C_1,d<V_3 C_2),AND(d>V_4 C_1,d<V_4 C_2),AND(d>V_5 C_1,d<V_5 C_2),AND(d>V_6 C_1,d<V_6 C_2)),d,0)","v":0},0,0]
[null,null,null,null,null,null,null,null,"2015-10-01",null,{"$f":"IF(OR(AND(d>V_1 A_1,d<V_1 A_2),AND(d>V_2 A_1,d<V_2 A_2),AND(d>V_3 A_1,d<V_3 A_2),AND(d>V_4 A_1,d<V_4 A_2),AND(d>V_5 A_1,d<V_5 A_2),AND(d>V_6 A_1,d<V_6 A_2)),d,0)","v":0},{"$f":"IF(OR(AND(d>V_1 B_1,d<V_1 B_2),AND(d>V_2 B_1,d<V_2 B_2),AND(d>V_3 B_1,d<V_3 B_2),AND(d>V_4 B_1,d<V_4 B_2),AND(d>V_5 B_1,d<V_5 B_2),AND(d>V_6 B_1,d<V_6 B_2)),d,0)","v":0},{"$f":"IF(OR(AND(d>V_1 C_1,d<V_1 C_2),AND(d>V_2 C_1,d<V_2 C_2),AND(d>V_3 C_1,d<V_3 C_2),AND(d>V_4 C_1,d<V_4 C_2),AND(d>V_5 C_1,d<V_5 C_2),AND(d>V_6 C_1,d<V_6 C_2)),d,0)","v":0},0,0]
[null,null,null,null,null,null,null,null,"2015-10-02",null,{"$f":"IF(OR(AND(d>V_1 A_1,d<V_1 A_2),AND(d>V_2 A_1,d<V_2 A_2),AND(d>V_3 A_1,d<V_3 A_2),AND(d>V_4 A_1,d<V_4 A_2),AND(d>V_5 A_1,d<V_5 A_2),AND(d>V_6 A_1,d<V_6 A_2)),d,0)","v":0},{"$f":"IF(OR(AND(d>V_1 B_1,d<V_1 B_2),AND(d>V_2 B_1,d<V_2 B_2),AND(d>V_3 B_1,d<V_3 B_2),AND(d>V_4 B_1,d<V_4 B_2),AND(d>V_5 B_1,d<V_5 B_2),AND(d>V_6 B_1,d<V_6 B_2)),d,0)","v":0},{"$f":"IF(OR(AND(d>V_1 C_1,d<V_1 C_2),AND(d>V_2 C_1,d<V_2 C_2),AND(d>V_3 C_1,d<V_3 C_2),AND(d>V_4 C_1,d<V_4 C_2),AND(d>V_5 C_1,d<V_5 C_2),AND(d>V_6 C_1,d<V_6 C_2)),d,0)","v":0},0,0]
[null,null,null,null,null,null,null,null,"2015-10-03",null,{"$f":"IF(OR(AND(d>V_1 A_1,d<V_1 A_2),AND(d>V_2 A_1,d<V_2 A_2),AND(d>V_3 A_1,d<V_3 A_2),AND(d>V_4 A_1,d<V_4 A_2),AND(d>V_5 A_1,d<V_5 A_2),AND(d>V_6 A_1,d<V_6 A_2)),d,0)","v":0},{"$f":"IF(OR(AND(d>V_1 B_1,d<V_1 B_2),AND(d>V_2 B_1,d<V_2 B_2),AND(d>V_3 B_1,d<V_3 B_2),AND(d>V_4 B_1,d<V_4 B_2),AND(d>V_5 B_1,d<V_5 B_2),AND(d>V_6 B_1,d<V_6 B_2)),d,0)","v":0},{"$f":"IF(OR(AND(d>V_1 C_1,d<V_1 C_2),AND(d>V_2 C_1,d<V_2 C_2),AND(d>V_3 C_1,d<V_3 C_2),AND(d>V_4 C_1,d<V_4 C_2),AND(d>V_5 C_1,d<V_5 C_2),AND(d>V_6 C_1,d<V_6 C_2)),d,0)","v":0},0,0]
[null,null,null,null,null,null,null,null,"2015-10-04",null,{"$f":"IF(OR(AND(d>V_1 A_1,d<V_1 A_2),AND(d>V_2 A_1,d<V_2 A_2),AND(d>V_3 A_1,d<V_3 A_2),AND(d>V_4 A_1,d<V_4 A_2),AND(d>V_5 A_1,d<V_5 A_2),AND(d>V_6 A_1,d<V_6 A_2)),d,0)","v":0},{"$f":"IF(OR(AND(d>V_1 B_1,d<V_1 B_2),AND(d>V_2 B_1,d<V_2 B_2),AND(d>V_3 B_1,d<V_3 B_2),AND(d>V_4 B_1,d<V_4 B_2),AND(d>V_5 B_1,d<V_5 B_2),AND(d>V_6 B_1,d<V_6 B_2)),d,0)","v":0},{"$f":"IF(OR(AND(d>V_1 C_1,d<V_1 C_2),AND(d>V_2 C_1,d<V_2 C_2),AND(d>V_3 C_1,d<V_3 C_2),AND(d>V_4 C_1,d<V_4 C_2),AND(d>V_5 C_1,d<V_5 C_2),AND(d>V_6 C_1,d<V_6 C_2)),d,0)","v":0},0,0]
[null,null,null,null,null,null,null,null,"2015-10-05",null,{"$f":"IF(OR(AND(d>V_1 A_1,d<V_1 A_2),AND(d>V_2 A_1,d<V_2 A_2),AND(d>V_3 A_1,d<V_3 A_2),AND(d>V_4 A_1,d<V_4 A_2),AND(d>V_5 A_1,d<V_5 A_2),AND(d>V_6 A_1,d<V_6 A_2)),d,0)","v":0},{"$f":"IF(OR(AND(d>V_1 B_1,d<V_1 B_2),AND(d>V_2 B_1,d<V_2 B_2),AND(d>V_3 B_1,d<V_3 B_2),AND(d>V_4 B_1,d<V_4 B_2),AND(d>V_5 B_1,d<V_5 B_2),AND(d>V_6 B_1,d<V_6 B_2)),d,0)","v":0},{"$f":"IF(OR(AND(d>V_1 C_1,d<V_1 C_2),AND(d>V_2 C_1,d<V_2 C_2),AND(d>V_3 C_1,d<V_3 C_2),AND(d>V_4 C_1,d<V_4 C_2),AND(d>V_5 C_1,d<V_5 C_2),AND(d>V_6 C_1,d<V_6 C_2)),d,0)","v":0},0,0]
[null,null,null,null,null,null,null,null,"2015-10-06",null,{"$f":"IF(OR(AND(d>V_1 A_1,d<V_1 A_2),AND(d>V_2 A_1,d<V_2 A_2),AND(d>V_3 A_1,d<V_3 A_2),AND(d>V_4 A_1,d<V_4 A_2),AND(d>V_5 A_1,d<V_5 A_2),AND(d>V_6 A_1,d<V_6 A_2)),d,0)","v":0},{"$f":"IF(OR(AND(d>V_1 B_1,d<V_1 B_2),AND(d>V_2 B_1,d<V_2 B_2),AND(d>V_3 B_1,d<V_3 B_2),AND(d>V_4 B_1,d<V_4 B_2),AND(d>V_5 B_1,d<V_5 B_2),AND(d>V_6 B_1,d<V_6 B_2)),d,0)","v":0},{"$f":"IF(OR(AND(d>V_1 C_1,d<V_1 C_2),AND(d>V_2 C_1,d<V_2 C_2),AND(d>V_3 C_1,d<V_3 C_2),AND(d>V_4 C_1,d<V_4 C_2),AND(d>V_5 C_1,d<V_5 C_2),AND(d>V_6 C_1,d<V_6 C_2)),d,0)","v":0},0,0]
[null,null,null,null,null,null,null,null,"2015-10-07",null,{"$f":"IF(OR(AND(d>V_1 A_1,d<V_1 A_2),AND(d>V_2 A_1,d<V_2 A_2),AND(d>V_3 A_1,d<V_3 A_2),AND(d>V_4 A_1,d<V_4 A_2),AND(d>V_5 A_1,d<V_5 A_2),AND(d>V_6 A_1,d<V_6 A_2)),d,0)","v":0},{"$f":"IF(OR(AND(d>V_1 B_1,d<V_1 B_2),AND(d>V_2 B_1,d<V_2 B_2),AND(d>V_3 B_1,d<V_3 B_2),AND(d>V_4 B_1,d<V_4 B_2),AND(d>V_5 B_1,d<V_5 B_2),AND(d>V_6 B_1,d<V_6 B_2)),d,0)","v":0},{"$f":"IF(OR(AND(d>V_1 C_1,d<V_1 C_2),AND(d>V_2 C_1,d<V_2 C_2),AND(d>V_3 C_1,d<V_3 C_2),AND(d>V_4 C_1,d<V_4 C_2),AND(d>V_5 C_1,d<V_5 C_2),AND(d>V_6 C_1,d<V_6 C_2)),d,0)","v":0},0,0]
[null,null,null,null,null,null,null,null,"2015-10-08",null,{"$f":"IF(OR(AND(d>V_1 A_1,d<V_1 A_2),AND(d>V_2 A_1,d<V_2 A_2),AND(d>V_3 A_1,d<V_3 A_2),AND(d>V_4 A_1,d<V_4 A_2),AND(d>V_5 A_1,d<V_5 A_2),AND(d>V_6 A_1,d<V_6 A_2)),d,0)","v":0},{"$f":"IF(OR(AND(d>V_1 B_1,d<V_1 B_2),AND(d>V_2 B_1,d<V_2 B_2),AND(d>V_3 B_1,d<V_3 B_2),AND(d>V_4 B_1,d<V_4 B_2),AND(d>V_5 B_1,d<V_5 B_2),AND(d>V_6 B_1,d<V_6 B_2)),d,0)","v":0},{"$f":"IF(OR(AND(d>V_1 C_1,d<V_1 C_2),AND(d>V_2 C_1,d<V_2 C_2),AND(d>V_3 C_1,d<V_3 C_2),AND(d>V_4 C_1,d<V_4 C_2),AND(d>V_5 C_1,d<V_5 C_2),AND(d>V_6 C_1,d<V_6 C_2)),d,0)","v":0},0,0]
[null,null,null,null,null,null,null,null,"2015-10-09",null,{"$f":"IF(OR(AND(d>V_1 A_1,d<V_1 A_2),AND(d>V_2 A_1,d<V_2 A_2),AND(d>V_3 A_1,d<V_3 A_2),AND(d>V_4 A_1,d<V_4 A_2),AND(d>V_5 A_1,d<V_5 A_2),AND(d>V_6 A_1,d<V_6 A_2)),d,0)","v":0},{"$f":"IF(OR(AND(d>V_1 B_1,d<V_1 B_2),AND(d>V_2 B_1,d<V_2 B_2),AND(d>V_3 B_1,d<V_3 B_2),AND(d>V_4 B_1,d<V_4 B_2),AND(d>V_5 B_1,d<V_5 B_2),AND(d>V_6 B_1,d<V_6 B_2)),d,0)","v":0},{"$f":"IF(OR(AND(d>V_1 C_1,d<V_1 C_2),AND(d>V_2 C_1,d<V_2 C_2),AND(d>V_3 C_1,d<V_3 C_2),AND(d>V_4 C_1,d<V_4 C_2),AND(d>V_5 C_1,d<V_5 C_2),AND(d>V_6 C_1,d<V_6 C_2)),d,0)","v":0},0,0]
[null,null,null,null,null,null,null,null,"2015-10-10",null,{"$f":"IF(OR(AND(d>V_1 A_1,d<V_1 A_2),AND(d>V_2 A_1,d<V_2 A_2),AND(d>V_3 A_1,d<V_3 A_2),AND(d>V_4 A_1,d<V_4 A_2),AND(d>V_5 A_1,d<V_5 A_2),AND(d>V_6 A_1,d<V_6 A_2)),d,0)","v":0},{"$f":"IF(OR(AND(d>V_1 B_1,d<V_1 B_2),AND(d>V_2 B_1,d<V_2 B_2),AND(d>V_3 B_1,d<V_3 B_2),AND(d>V_4 B_1,d<V_4 B_2),AND(d>V_5 B_1,d<V_5 B_2),AND(d>V_6 B_1,d<V_6 B_2)),d,0)","v":0},{"$f":"IF(OR(AND(d>V_1 C_1,d<V_1 C_2),AND(d>V_2 C_1,d<V_2 C_2),AND(d>V_3 C_1,d<V_3 C_2),AND(d>V_4 C_1,d<V_4 C_2),AND(d>V_5 C_1,d<V_5 C_2),AND(d>V_6 C_1,d<V_6 C_2)),d,0)","v":0},0,0]
[null,null,null,null,null,null,null,null,"2015-10-11",null,{"$f":"IF(OR(AND(d>V_1 A_1,d<V_1 A_2),AND(d>V_2 A_1,d<V_2 A_2),AND(d>V_3 A_1,d<V_3 A_2),AND(d>V_4 A_1,d<V_4 A_2),AND(d>V_5 A_1,d<V_5 A_2),AND(d>V_6 A_1,d<V_6 A_2)),d,0)","v":0},{"$f":"IF(OR(AND(d>V_1 B_1,d<V_1 B_2),AND(d>V_2 B_1,d<V_2 B_2),AND(d>V_3 B_1,d<V_3 B_2),AND(d>V_4 B_1,d<V_4 B_2),AND(d>V_5 B_1,d<V_5 B_2),AND(d>V_6 B_1,d<V_6 B_2)),d,0)","v":0},{"$f":"IF(OR(AND(d>V_1 C_1,d<V_1 C_2),AND(d>V_2 C_1,d<V_2 C_2),AND(d>V_3 C_1,d<V_3 C_2),AND(d>V_4 C_1,d<V_4 C_2),AND(d>V_5 C_1,d<V_5 C_2),AND(d>V_6 C_1,d<V_6 C_2)),d,0)","v":0},0,0]
[null,null,null,null,null,null,null,null,"2015-10-12",null,{"$f":"IF(OR(AND(d>V_1 A_1,d<V_1 A_2),AND(d>V_2 A_1,d<V_2 A_2),AND(d>V_3 A_1,d<V_3 A_2),AND(d>V_4 A_1,d<V_4 A_2),AND(d>V_5 A_1,d<V_5 A_2),AND(d>V_6 A_1,d<V_6 A_2)),d,0)","v":0},{"$f":"IF(OR(AND(d>V_1 B_1,d<V_1 B_2),AND(d>V_2 B_1,d<V_2 B_2),AND(d>V_3 B_1,d<V_3 B_2),AND(d>V_4 B_1,d<V_4 B_2),AND(d>V_5 B_1,d<V_5 B_2),AND(d>V_6 B_1,d<V_6 B_2)),d,0)","v":0},{"$f":"IF(OR(AND(d>V_1 C_1,d<V_1 C_2),AND(d>V_2 C_1,d<V_2 C_2),AND(d>V_3 C_1,d<V_3 C_2),AND(d>V_4 C_1,d<V_4 C_2),AND(d>V_5 C_1,d<V_5 C_2),AND(d>V_6 C_1,d<V_6 C_2)),d,0)","v":0},0,0]
[null,null,null,null,null,null,null,null,"2015-10-13",null,{"$f":"IF(OR(AND(d>V_1 A_1,d<V_1 A_2),AND(d>V_2 A_1,d<V_2 A_2),AND(d>V_3 A_1,d<V_3 A_2),AND(d>V_4 A_1,d<V_4 A_2),AND(d>V_5 A_1,d<V_5 A_2),AND(d>V_6 A_1,d<V_6 A_2)),d,0)","v":0},{"$f":"IF(OR(AND(d>V_1 B_1,d<V_1 B_2),AND(d>V_2 B_1,d<V_2 B_2),AND(d>V_3 B_1,d<V_3 B_2),AND(d>V_4 B_1,d<V_4 B_2),AND(d>V_5 B_1,d<V_5 B_2),AND(d>V_6 B_1,d<V_6 B_2)),d,0)","v":0},{"$f":"IF(OR(AND(d>V_1 C_1,d<V_1 C_2),AND(d>V_2 C_1,d<V_2 C_2),AND(d>V_3 C_1,d<V_3 C_2),AND(d>V_4 C_1,d<V_4 C_2),AND(d>V_5 C_1,d<V_5 C_2),AND(d>V_6 C_1,d<V_6 C_2)),d,0)","v":0},0,0]
[null,null,null,null,null,null,null,null,"2015-10-14",null,{"$f":"IF(OR(AND(d>V_1 A_1,d<V_1 A_2),AND(d>V_2 A_1,d<V_2 A_2),AND(d>V_3 A_1,d<V_3 A_2),AND(d>V_4 A_1,d<V_4 A_2),AND(d>V_5 A_1,d<V_5 A_2),AND(d>V_6 A_1,d<V_6 A_2)),d,0)","v":0},{"$f":"IF(OR(AND(d>V_1 B_1,d<V_1 B_2),AND(d>V_2 B_1,d<V_2 B_2),AND(d>V_3 B_1,d<V_3 B_2),AND(d>V_4 B_1,d<V_4 B_2),AND(d>V_5 B_1,d<V_5 B_2),AND(d>V_6 B_1,d<V_6 B_2)),d,0)","v":0},{"$f":"IF(OR(AND(d>V_1 C_1,d<V_1 C_2),AND(d>V_2 C_1,d<V_2 C_2),AND(d>V_3 C_1,d<V_3 C_2),AND(d>V_4 C_1,d<V_4 C_2),AND(d>V_5 C_1,d<V_5 C_2),AND(d>V_6 C_1,d<V_6 C_2)),d,0)","v":0},0,0]
[null,null,null,null,null,null,null,null,"2015-10-15",null,{"$f":"IF(OR(AND(d>V_1 A_1,d<V_1 A_2),AND(d>V_2 A_1,d<V_2 A_2),AND(d>V_3 A_1,d<V_3 A_2),AND(d>V_4 A_1,d<V_4 A_2),AND(d>V_5 A_1,d<V_5 A_2),AND(d>V_6 A_1,d<V_6 A_2)),d,0)","v":0},{"$f":"IF(OR(AND(d>V_1 B_1,d<V_1 B_2),AND(d>V_2 B_1,d<V_2 B_2),AND(d>V_3 B_1,d<V_3 B_2),AND(d>V_4 B_1,d<V_4 B_2),AND(d>V_5 B_1,d<V_5 B_2),AND(d>V_6 B_1,d<V_6 B_2)),d,0)","v":0},{"$f":"IF(OR(AND(d>V_1 C_1,d<V_1 C_2),AND(d>V_2 C_1,d<V_2 C_2),AND(d>V_3 C_1,d<V_3 C_2),AND(d>V_4 C_1,d<V_4 C_2),AND(d>V_5 C_1,d<V_5 C_2),AND(d>V_6 C_1,d<V_6 C_2)),d,0)","v":0},0,0]
[null,null,null,null,null,null,null,null,"2015-10-16",null,{"$f":"IF(OR(AND(d>V_1 A_1,d<V_1 A_2),AND(d>V_2 A_1,d<V_2 A_2),AND(d>V_3 A_1,d<V_3 A_2),AND(d>V_4 A_1,d<V_4 A_2),AND(d>V_5 A_1,d<V_5 A_2),AND(d>V_6 A_1,d<V_6 A_2)),d,0)","v":0},{"$f":"IF(OR(AND(d>V_1 B_1,d<V_1 B_2),AND(d>V_2 B_1,d<V_2 B_2),AND(d>V_3 B_1,d<V_3 B_2),AND(d>V_4 B_1,d<V_4 B_2),AND(d>V_5 B_1,d<V_5 B_2),AND(d>V_6 B_1,d<V_6 B_2)),d,0)","v":0},{"$f":"IF(OR(AND(d>V_1 C_1,d<V_1 C_2),AND(d>V_2 C_1,d<V_2 C_2),AND(d>V_3 C_1,d<V_3 C_2),AND(d>V_4 C_1,d<V_4 C_2),AND(d>V_5 C_1,d<V_5 C_2),AND(d>V_6 C_1,d<V_6 C_2)),d,0)","v":0},0,0]
[null,null,null,null,null,null,null,null,"2015-10-17",null,{"$f":"IF(OR(AND(d>V_1 A_1,d<V_1 A_2),AND(d>V_2 A_1,d<V_2 A_2),AND(d>V_3 A_1,d<V_3 A_2),AND(d>V_4 A_1,d<V_4 A_2),AND(d>V_5 A_1,d<V_5 A_2),AND(d>V_6 A_1,d<V_6 A_2)),d,0)","v":0},{"$f":"IF(OR(AND(d>V_1 B_1,d<V_1 B_2),AND(d>V_2 B_1,d<V_2 B_2),AND(d>V_3 B_1,d<V_3 B_2),AND(d>V_4 B_1,d<V_4 B_2),AND(d>V_5 B_1,d<V_5 B_2),AND(d>V_6 B_1,d<V_6 B_2)),d,0)","v":0},{"$f":"IF(OR(AND(d>V_1 C_1,d<V_1 C_2),AND(d>V_2 C_1,d<V_2 C_2),AND(d>V_3 C_1,d<V_3 C_2),AND(d>V_4 C_1,d<V_4 C_2),AND(d>V_5 C_1,d<V_5 C_2),AND(d>V_6 C_1,d<V_6 C_2)),d,0)","v":0},0,0]
[null,null,null,null,null,null,null,null,"2015-10-18",null,{"$f":"IF(OR(AND(d>V_1 A_1,d<V_1 A_2),AND(d>V_2 A_1,d<V_2 A_2),AND(d>V_3 A_1,d<V_3 A_2),AND(d>V_4 A_1,d<V_4 A_2),AND(d>V_5 A_1,d<V_5 A_2),AND(d>V_6 A_1,d<V_6 A_2)),d,0)","v":42295},{"$f":"IF(OR(AND(d>V_1 B_1,d<V_1 B_2),AND(d>V_2 B_1,d<V_2 B_2),AND(d>V_3 B_1,d<V_3 B_2),AND(d>V_4 B_1,d<V_4 B_2),AND(d>V_5 B_1,d<V_5 B_2),AND(d>V_6 B_1,d<V_6 B_2)),d,0)","v":42295},{"$f":"IF(OR(AND(d>V_1 C_1,d<V_1 C_2),AND(d>V_2 C_1,d<V_2 C_2),AND(d>V_3 C_1,d<V_3 C_2),AND(d>V_4 C_1,d<V_4 C_2),AND(d>V_5 C_1,d<V_5 C_2),AND(d>V_6 C_1,d<V_6 C_2)),d,0)","v":42295},42295,42295]
[null,null,null,null,null,null,null,null,"2015-10-19",null,{"$f":"IF(OR(AND(d>V_1 A_1,d<V_1 A_2),AND(d>V_2 A_1,d<V_2 A_2),AND(d>V_3 A_1,d<V_3 A_2),AND(d>V_4 A_1,d<V_4 A_2),AND(d>V_5 A_1,d<V_5 A_2),AND(d>V_6 A_1,d<V_6 A_2)),d,0)","v":42296},{"$f":"IF(OR(AND(d>V_1 B_1,d<V_1 B_2),AND(d>V_2 B_1,d<V_2 B_2),AND(d>V_3 B_1,d<V_3 B_2),AND(d>V_4 B_1,d<V_4 B_2),AND(d>V_5 B_1,d<V_5 B_2),AND(d>V_6 B_1,d<V_6 B_2)),d,0)","v":42296},{"$f":"IF(OR(AND(d>V_1 C_1,d<V_1 C_2),AND(d>V_2 C_1,d<V_2 C_2),AND(d>V_3 C_1,d<V_3 C_2),AND(d>V_4 C_1,d<V_4 C_2),AND(d>V_5 C_1,d<V_5 C_2),AND(d>V_6 C_1,d<V_6 C_2)),d,0)","v":42296},42296,42296]
[null,null,null,null,null,null,null,null,"2015-10-20",null,{"$f":"IF(OR(AND(d>V_1 A_1,d<V_1 A_2),AND(d>V_2 A_1,d<V_2 A_2),AND(d>V_3 A_1,d<V_3 A_2),AND(d>V_4 A_1,d<V_4 A_2),AND(d>V_5 A_1,d<V_5 A_2),AND(d>V_6 A_1,d<V_6 A_2)),d,0)","v":42297},{"$f":"IF(OR(AND(d>V_1 B_1,d<V_1 B_2),AND(d>V_2 B_1,d<V_2 B_2),AND(d>V_3 B_1,d<V_3 B_2),AND(d>V_4 B_1,d<V_4 B_2),AND(d>V_5 B_1,d<V_5 B_2),AND(d>V_6 B_1,d<V_6 B_2)),d,0)","v":42297},{"$f":"IF(OR(AND(d>V_1 C_1,d<V_1 C_2),AND(d>V_2 C_1,d<V_2 C_2),AND(d>V_3 C_1,d<V_3 C_2),AND(d>V_4 C_1,d<V_4 C_2),AND(d>V_5 C_1,d<V_5 C_2),AND(d>V_6 C_1,d<V_6 C_2)),d,0)","v":42297},42297,42297]
[null,null,null,null,null,null,null,null,"2015-10-21",null,{"$f":"IF(OR(AND(d>V_1 A_1,d<V_1 A_2),AND(d>V_2 A_1,d<V_2 A_2),AND(d>V_3 A_1,d<V_3 A_2),AND(d>V_4 A_1,d<V_4 A_2),AND(d>V_5 A_1,d<V_5 A_2),AND(d>V_6 A_1,d<V_6 A_2)),d,0)","v":42298},{"$f":"IF(OR(AND(d>V_1 B_1,d<V_1 B_2),AND(d>V_2 B_1,d<V_2 B_2),AND(d>V_3 B_1,d<V_3 B_2),AND(d>V_4 B_1,d<V_4 B_2),AND(d>V_5 B_1,d<V_5 B_2),AND(d>V_6 B_1,d<V_6 B_2)),d,0)","v":42298},{"$f":"IF(OR(AND(d>V_1 C_1,d<V_1 C_2),AND(d>V_2 C_1,d<V_2 C_2),AND(d>V_3 C_1,d<V_3 C_2),AND(d>V_4 C_1,d<V_4 C_2),AND(d>V_5 C_1,d<V_5 C_2),AND(d>V_6 C_1,d<V_6 C_2)),d,0)","v":42298},42298,42298]
[null,null,null,null,null,null,null,null,"2015-10-22",null,{"$f":"IF(OR(AND(d>V_1 A_1,d<V_1 A_2),AND(d>V_2 A_1,d<V_2 A_2),AND(d>V_3 A_1,d<V_3 A_2),AND(d>V_4 A_1,d<V_4 A_2),AND(d>V_5 A_1,d<V_5 A_2),AND(d>V_6 A_1,d<V_6 A_2)),d,0)","v":42299},{"$f":"IF(OR(AND(d>V_1 B_1,d<V_1 B_2),AND(d>V_2 B_1,d<V_2 B_2),AND(d>V_3 B_1,d<V_3 B_2),AND(d>V_4 B_1,d<V_4 B_2),AND(d>V_5 B_1,d<V_5 B_2),AND(d>V_6 B_1,d<V_6 B_2)),d,0)","v":42299},{"$f":"IF(OR(AND(d>V_1 C_1,d<V_1 C_2),AND(d>V_2 C_1,d<V_2 C_2),AND(d>V_3 C_1,d<V_3 C_2),AND(d>V_4 C_1,d<V_4 C_2),AND(d>V_5 C_1,d<V_5 C_2),AND(d>V_6 C_1,d<V_6 C_2)),d,0)","v":42299},42299,42299]
[null,null,null,null,null,null,null,null,"2015-10-23",null,{"$f":"IF(OR(AND(d>V_1 A_1,d<V_1 A_2),AND(d>V_2 A_1,d<V_2 A_2),AND(d>V_3 A_1,d<V_3 A_2),AND(d>V_4 A_1,d<V_4 A_2),AND(d>V_5 A_1,d<V_5 A_2),AND(d>V_6 A_1,d<V_6 A_2)),d,0)","v":42300},{"$f":"IF(OR(AND(d>V_1 B_1,d<V_1 B_2),AND(d>V_2 B_1,d<V_2 B_2),AND(d>V_3 B_1,d<V_3 B_2),AND(d>V_4 B_1,d<V_4 B_2),AND(d>V_5 B_1,d<V_5 B_2),AND(d>V_6 B_1,d<V_6 B_2)),d,0)","v":42300},{"$f":"IF(OR(AND(d>V_1 C_1,d<V_1 C_2),AND(d>V_2 C_1,d<V_2 C_2),AND(d>V_3 C_1,d<V_3 C_2),AND(d>V_4 C_1,d<V_4 C_2),AND(d>V_5 C_1,d<V_5 C_2),AND(d>V_6 C_1,d<V_6 C_2)),d,0)","v":42300},42300,42300]
[null,null,null,null,null,null,null,null,"2015-10-24",null,{"$f":"IF(OR(AND(d>V_1 A_1,d<V_1 A_2),AND(d>V_2 A_1,d<V_2 A_2),AND(d>V_3 A_1,d<V_3 A_2),AND(d>V_4 A_1,d<V_4 A_2),AND(d>V_5 A_1,d<V_5 A_2),AND(d>V_6 A_1,d<V_6 A_2)),d,0)","v":42301},{"$f":"IF(OR(AND(d>V_1 B_1,d<V_1 B_2),AND(d>V_2 B_1,d<V_2 B_2),AND(d>V_3 B_1,d<V_3 B_2),AND(d>V_4 B_1,d<V_4 B_2),AND(d>V_5 B_1,d<V_5 B_2),AND(d>V_6 B_1,d<V_6 B_2)),d,0)","v":42301},{"$f":"IF(OR(AND(d>V_1 C_1,d<V_1 C_2),AND(d>V_2 C_1,d<V_2 C_2),AND(d>V_3 C_1,d<V_3 C_2),AND(d>V_4 C_1,d<V_4 C_2),AND(d>V_5 C_1,d<V_5 C_2),AND(d>V_6 C_1,d<V_6 C_2)),d,0)","v":42301},42301,42301]
[null,null,null,null,null,null,null,null,"2015-10-25",null,{"$f":"IF(OR(AND(d>V_1 A_1,d<V_1 A_2),AND(d>V_2 A_1,d<V_2 A_2),AND(d>V_3 A_1,d<V_3 A_2),AND(d>V_4 A_1,d<V_4 A_2),AND(d>V_5 A_1,d<V_5 A_2),AND(d>V_6 A_1,d<V_6 A_2)),d,0)","v":42302},{"$f":"IF(OR(AND(d>V_1 B_1,d<V_1 B_2),AND(d>V_2 B_1,d<V_2 B_2),AND(d>V_3 B_1,d<V_3 B_2),AND(d>V_4 B_1,d<V_4 B_2),AND(d>V_5 B_1,d<V_5 B_2),AND(d>V_6 B_1,d<V_6 B_2)),d,0)","v":42302},{"$f":"IF(OR(AND(d>V_1 C_1,d<V_1 C_2),AND(d>V_2 C_1,d<V_2 C_2),AND(d>V_3 C_1,d<V_3 C_2),AND(d>V_4 C_1,d<V_4 C_2),AND(d>V_5 C_1,d<V_5 C_2),AND(d>V_6 C_1,d<V_6 C_2)),d,0)","v":42302},42302,42302]
[null,null,null,null,null,null,null,null,"2015-10-26",null,{"$f":"IF(OR(AND(d>V_1 A_1,d<V_1 A_2),AND(d>V_2 A_1,d<V_2 A_2),AND(d>V_3 A_1,d<V_3 A_2),AND(d>V_4 A_1,d<V_4 A_2),AND(d>V_5 A_1,d<V_5 A_2),AND(d>V_6 A_1,d<V_6 A_2)),d,0)","v":42303},{"$f":"IF(OR(AND(d>V_1 B_1,d<V_1 B_2),AND(d>V_2 B_1,d<V_2 B_2),AND(d>V_3 B_1,d<V_3 B_2),AND(d>V_4 B_1,d<V_4 B_2),AND(d>V_5 B_1,d<V_5 B_2),AND(d>V_6 B_1,d<V_6 B_2)),d,0)","v":42303},{"$f":"IF(OR(AND(d>V_1 C_1,d<V_1 C_2),AND(d>V_2 C_1,d<V_2 C_2),AND(d>V_3 C_1,d<V_3 C_2),AND(d>V_4 C_1,d<V_4 C_2),AND(d>V_5 C_1,d<V_5 C_2),AND(d>V_6 C_1,d<V_6 C_2)),d,0)","v":42303},42303,42303]
[null,null,null,null,null,null,null,null,"2015-10-27",null,{"$f":"IF(OR(AND(d>V_1 A_1,d<V_1 A_2),AND(d>V_2 A_1,d<V_2 A_2),AND(d>V_3 A_1,d<V_3 A_2),AND(d>V_4 A_1,d<V_4 A_2),AND(d>V_5 A_1,d<V_5 A_2),AND(d>V_6 A_1,d<V_6 A_2)),d,0)","v":42304},{"$f":"IF(OR(AND(d>V_1 B_1,d<V_1 B_2),AND(d>V_2 B_1,d<V_2 B_2),AND(d>V_3 B_1,d<V_3 B_2),AND(d>V_4 B_1,d<V_4 B_2),AND(d>V_5 B_1,d<V_5 B_2),AND(d>V_6 B_1,d<V_6 B_2)),d,0)","v":42304},{"$f":"IF(OR(AND(d>V_1 C_1,d<V_1 C_2),AND(d>V_2 C_1,d<V_2 C_2),AND(d>V_3 C_1,d<V_3 C_2),AND(d>V_4 C_1,d<V_4 C_2),AND(d>V_5 C_1,d<V_5 C_2),AND(d>V_6 C_1,d<V_6 C_2)),d,0)","v":42304},42304,42304]
[null,null,null,null,null,null,null,null,"2015-10-28",null,{"$f":"IF(OR(AND(d>V_1 A_1,d<V_1 A_2),AND(d>V_2 A_1,d<V_2 A_2),AND(d>V_3 A_1,d<V_3 A_2),AND(d>V_4 A_1,d<V_4 A_2),AND(d>V_5 A_1,d<V_5 A_2),AND(d>V_6 A_1,d<V_6 A_2)),d,0)","v":42305},{"$f":"IF(OR(AND(d>V_1 B_1,d<V_1 B_2),AND(d>V_2 B_1,d<V_2 B_2),AND(d>V_3 B_1,d<V_3 B_2),AND(d>V_4 B_1,d<V_4 B_2),AND(d>V_5 B_1,d<V_5 B_2),AND(d>V_6 B_1,d<V_6 B_2)),d,0)","v":42305},{"$f":"IF(OR(AND(d>V_1 C_1,d<V_1 C_2),AND(d>V_2 C_1,d<V_2 C_2),AND(d>V_3 C_1,d<V_3 C_2),AND(d>V_4 C_1,d<V_4 C_2),AND(d>V_5 C_1,d<V_5 C_2),AND(d>V_6 C_1,d<V_6 C_2)),d,0)","v":42305},42305,42305]
[null,null,null,null,null,null,null,null,"2015-10-29",null,{"$f":"IF(OR(AND(d>V_1 A_1,d<V_1 A_2),AND(d>V_2 A_1,d<V_2 A_2),AND(d>V_3 A_1,d<V_3 A_2),AND(d>V_4 A_1,d<V_4 A_2),AND(d>V_5 A_1,d<V_5 A_2),AND(d>V_6 A_1,d<V_6 A_2)),d,0)","v":42306},{"$f":"IF(OR(AND(d>V_1 B_1,d<V_1 B_2),AND(d>V_2 B_1,d<V_2 B_2),AND(d>V_3 B_1,d<V_3 B_2),AND(d>V_4 B_1,d<V_4 B_2),AND(d>V_5 B_1,d<V_5 B_2),AND(d>V_6 B_1,d<V_6 B_2)),d,0)","v":42306},{"$f":"IF(OR(AND(d>V_1 C_1,d<V_1 C_2),AND(d>V_2 C_1,d<V_2 C_2),AND(d>V_3 C_1,d<V_3 C_2),AND(d>V_4 C_1,d<V_4 C_2),AND(d>V_5 C_1,d<V_5 C_2),AND(d>V_6 C_1,d<V_6 C_2)),d,0)","v":42306},42306,42306]
[null,null,null,null,null,null,null,null,"2015-10-30",null,{"$f":"IF(OR(AND(d>V_1 A_1,d<V_1 A_2),AND(d>V_2 A_1,d<V_2 A_2),AND(d>V_3 A_1,d<V_3 A_2),AND(d>V_4 A_1,d<V_4 A_2),AND(d>V_5 A_1,d<V_5 A_2),AND(d>V_6 A_1,d<V_6 A_2)),d,0)","v":42307},{"$f":"IF(OR(AND(d>V_1 B_1,d<V_1 B_2),AND(d>V_2 B_1,d<V_2 B_2),AND(d>V_3 B_1,d<V_3 B_2),AND(d>V_4 B_1,d<V_4 B_2),AND(d>V_5 B_1,d<V_5 B_2),AND(d>V_6 B_1,d<V_6 B_2)),d,0)","v":42307},{"$f":"IF(OR(AND(d>V_1 C_1,d<V_1 C_2),AND(d>V_2 C_1,d<V_2 C_2),AND(d>V_3 C_1,d<V_3 C_2),AND(d>V_4 C_1,d<V_4 C_2),AND(d>V_5 C_1,d<V_5 C_2),AND(d>V_6 C_1,d<V_6 C_2)),d,0)","v":42307},42307,42307]
[null,null,null,null,null,null,null,null,"2015-10-31",null,{"$f":"IF(OR(AND(d>V_1 A_1,d<V_1 A_2),AND(d>V_2 A_1,d<V_2 A_2),AND(d>V_3 A_1,d<V_3 A_2),AND(d>V_4 A_1,d<V_4 A_2),AND(d>V_5 A_1,d<V_5 A_2),AND(d>V_6 A_1,d<V_6 A_2)),d,0)","v":42308},{"$f":"IF(OR(AND(d>V_1 B_1,d<V_1 B_2),AND(d>V_2 B_1,d<V_2 B_2),AND(d>V_3 B_1,d<V_3 B_2),AND(d>V_4 B_1,d<V_4 B_2),AND(d>V_5 B_1,d<V_5 B_2),AND(d>V_6 B_1,d<V_6 B_2)),d,0)","v":42308},{"$f":"IF(OR(AND(d>V_1 C_1,d<V_1 C_2),AND(d>V_2 C_1,d<V_2 C_2),AND(d>V_3 C_1,d<V_3 C_2),AND(d>V_4 C_1,d<V_4 C_2),AND(d>V_5 C_1,d<V_5 C_2),AND(d>V_6 C_1,d<V_6 C_2)),d,0)","v":42308},42308,42308]
[null,null,null,null,null,null,null,null,"2015-11-01",null,{"$f":"IF(OR(AND(d>V_1 A_1,d<V_1 A_2),AND(d>V_2 A_1,d<V_2 A_2),AND(d>V_3 A_1,d<V_3 A_2),AND(d>V_4 A_1,d<V_4 A_2),AND(d>V_5 A_1,d<V_5 A_2),AND(d>V_6 A_1,d<V_6 A_2)),d,0)","v":42309},{"$f":"IF(OR(AND(d>V_1 B_1,d<V_1 B_2),AND(d>V_2 B_1,d<V_2 B_2),AND(d>V_3 B_1,d<V_3 B_2),AND(d>V_4 B_1,d<V_4 B_2),AND(d>V_5 B_1,d<V_5 B_2),AND(d>V_6 B_1,d<V_6 B_2)),d,0)","v":42309},{"$f":"IF(OR(AND(d>V_1 C_1,d<V_1 C_2),AND(d>V_2 C_1,d<V_2 C_2),AND(d>V_3 C_1,d<V_3 C_2),AND(d>V_4 C_1,d<V_4 C_2),AND(d>V_5 C_1,d<V_5 C_2),AND(d>V_6 C_1,d<V_6 C_2)),d,0)","v":42309},42309,42309]
[null,null,null,null,null,null,null,null,"2015-11-02",null,{"$f":"IF(OR(AND(d>V_1 A_1,d<V_1 A_2),AND(d>V_2 A_1,d<V_2 A_2),AND(d>V_3 A_1,d<V_3 A_2),AND(d>V_4 A_1,d<V_4 A_2),AND(d>V_5 A_1,d<V_5 A_2),AND(d>V_6 A_1,d<V_6 A_2)),d,0)","v":0},{"$f":"IF(OR(AND(d>V_1 B_1,d<V_1 B_2),AND(d>V_2 B_1,d<V_2 B_2),AND(d>V_3 B_1,d<V_3 B_2),AND(d>V_4 B_1,d<V_4 B_2),AND(d>V_5 B_1,d<V_5 B_2),AND(d>V_6 B_1,d<V_6 B_2)),d,0)","v":0},{"$f":"IF(OR(AND(d>V_1 C_1,d<V_1 C_2),AND(d>V_2 C_1,d<V_2 C_2),AND(d>V_3 C_1,d<V_3 C_2),AND(d>V_4 C_1,d<V_4 C_2),AND(d>V_5 C_1,d<V_5 C_2),AND(d>V_6 C_1,d<V_6 C_2)),d,0)","v":0},0,0]
[null,null,null,null,null,null,null,null,"2015-11-03",null,{"$f":"IF(OR(AND(d>V_1 A_1,d<V_1 A_2),AND(d>V_2 A_1,d<V_2 A_2),AND(d>V_3 A_1,d<V_3 A_2),AND(d>V_4 A_1,d<V_4 A_2),AND(d>V_5 A_1,d<V_5 A_2),AND(d>V_6 A_1,d<V_6 A_2)),d,0)","v":0},{"$f":"IF(OR(AND(d>V_1 B_1,d<V_1 B_2),AND(d>V_2 B_1,d<V_2 B_2),AND(d>V_3 B_1,d<V_3 B_2),AND(d>V_4 B_1,d<V_4 B_2),AND(d>V_5 B_1,d<V_5 B_2),AND(d>V_6 B_1,d<V_6 B_2)),d,0)","v":0},{"$f":"IF(OR(AND(d>V_1 C_1,d<V_1 C_2),AND(d>V_2 C_1,d<V_2 C_2),AND(d>V_3 C_1,d<V_3 C_2),AND(d>V_4 C_1,d<V_4 C_2),AND(d>V_5 C_1,d<V_5 C_2),AND(d>V_6 C_1,d<V_6 C_2)),d,0)","v":0},0,0]
[null,null,null,null,null,null,null,null,"2015-11-04",null,{"$f":"IF(OR(AND(d>V_1 A_1,d<V_1 A_2),AND(d>V_2 A_1,d<V_2 A_2),AND(d>V_3 A_1,d<V_3 A_2),AND(d>V_4 A_1,d<V_4 A_2),AND(d>V_5 A_1,d<V_5 A_2),AND(d>V_6 A_1,d<V_6 A_2)),d,0)","v":0},{"$f":"IF(OR(AND(d>V_1 B_1,d<V_1 B_2),AND(d>V_2 B_1,d<V_2 B_2),AND(d>V_3 B_1,d<V_3 B_2),AND(d>V_4 B_1,d<V_4 B_2),AND(d>V_5 B_1,d<V_5 B_2),AND(d>V_6 B_1,d<V_6 B_2)),d,0)","v":0},{"$f":"IF(OR(AND(d>V_1 C_1,d<V_1 C_2),AND(d>V_2 C_1,d<V_2 C_2),AND(d>V_3 C_1,d<V_3 C_2),AND(d>V_4 C_1,d<V_4 C_2),AND(d>V_5 C_1,d<V_5 C_2),AND(d>V_6 C_1,d<V_6 C_2)),d,0)","v":0},0,0]
[null,null,null,null,null,null,null,null,"2015-11-05",null,{"$f":"IF(OR(AND(d>V_1 A_1,d<V_1 A_2),AND(d>V_2 A_1,d<V_2 A_2),AND(d>V_3 A_1,d<V_3 A_2),AND(d>V_4 A_1,d<V_4 A_2),AND(d>V_5 A_1,d<V_5 A_2),AND(d>V_6 A_1,d<V_6 A_2)),d,0)","v":0},{"$f":"IF(OR(AND(d>V_1 B_1,d<V_1 B_2),AND(d>V_2 B_1,d<V_2 B_2),AND(d>V_3 B_1,d<V_3 B_2),AND(d>V_4 B_1,d<V_4 B_2),AND(d>V_5 B_1,d<V_5 B_2),AND(d>V_6 B_1,d<V_6 B_2)),d,0)","v":0},{"$f":"IF(OR(AND(d>V_1 C_1,d<V_1 C_2),AND(d>V_2 C_1,d<V_2 C_2),AND(d>V_3 C_1,d<V_3 C_2),AND(d>V_4 C_1,d<V_4 C_2),AND(d>V_5 C_1,d<V_5 C_2),AND(d>V_6 C_1,d<V_6 C_2)),d,0)","v":0},0,0]
[null,null,null,null,null,null,null,null,"2015-11-06",null,{"$f":"IF(OR(AND(d>V_1 A_1,d<V_1 A_2),AND(d>V_2 A_1,d<V_2 A_2),AND(d>V_3 A_1,d<V_3 A_2),AND(d>V_4 A_1,d<V_4 A_2),AND(d>V_5 A_1,d<V_5 A_2),AND(d>V_6 A_1,d<V_6 A_2)),d,0)","v":0},{"$f":"IF(OR(AND(d>V_1 B_1,d<V_1 B_2),AND(d>V_2 B_1,d<V_2 B_2),AND(d>V_3 B_1,d<V_3 B_2),AND(d>V_4 B_1,d<V_4 B_2),AND(d>V_5 B_1,d<V_5 B_2),AND(d>V_6 B_1,d<V_6 B_2)),d,0)","v":0},{"$f":"IF(OR(AND(d>V_1 C_1,d<V_1 C_2),AND(d>V_2 C_1,d<V_2 C_2),AND(d>V_3 C_1,d<V_3 C_2),AND(d>V_4 C_1,d<V_4 C_2),AND(d>V_5 C_1,d<V_5 C_2),AND(d>V_6 C_1,d<V_6 C_2)),d,0)","v":0},0,0]
[null,null,null,null,null,null,null,null,"2015-11-07",null,{"$f":"IF(OR(AND(d>V_1 A_1,d<V_1 A_2),AND(d>V_2 A_1,d<V_2 A_2),AND(d>V_3 A_1,d<V_3 A_2),AND(d>V_4 A_1,d<V_4 A_2),AND(d>V_5 A_1,d<V_5 A_2),AND(d>V_6 A_1,d<V_6 A_2)),d,0)","v":0},{"$f":"IF(OR(AND(d>V_1 B_1,d<V_1 B_2),AND(d>V_2 B_1,d<V_2 B_2),AND(d>V_3 B_1,d<V_3 B_2),AND(d>V_4 B_1,d<V_4 B_2),AND(d>V_5 B_1,d<V_5 B_2),AND(d>V_6 B_1,d<V_6 B_2)),d,0)","v":0},{"$f":"IF(OR(AND(d>V_1 C_1,d<V_1 C_2),AND(d>V_2 C_1,d<V_2 C_2),AND(d>V_3 C_1,d<V_3 C_2),AND(d>V_4 C_1,d<V_4 C_2),AND(d>V_5 C_1,d<V_5 C_2),AND(d>V_6 C_1,d<V_6 C_2)),d,0)","v":0},0,0]
[null,null,null,null,null,null,null,null,"2015-11-08",null,{"$f":"IF(OR(AND(d>V_1 A_1,d<V_1 A_2),AND(d>V_2 A_1,d<V_2 A_2),AND(d>V_3 A_1,d<V_3 A_2),AND(d>V_4 A_1,d<V_4 A_2),AND(d>V_5 A_1,d<V_5 A_2),AND(d>V_6 A_1,d<V_6 A_2)),d,0)","v":0},{"$f":"IF(OR(AND(d>V_1 B_1,d<V_1 B_2),AND(d>V_2 B_1,d<V_2 B_2),AND(d>V_3 B_1,d<V_3 B_2),AND(d>V_4 B_1,d<V_4 B_2),AND(d>V_5 B_1,d<V_5 B_2),AND(d>V_6 B_1,d<V_6 B_2)),d,0)","v":0},{"$f":"IF(OR(AND(d>V_1 C_1,d<V_1 C_2),AND(d>V_2 C_1,d<V_2 C_2),AND(d>V_3 C_1,d<V_3 C_2),AND(d>V_4 C_1,d<V_4 C_2),AND(d>V_5 C_1,d<V_5 C_2),AND(d>V_6 C_1,d<V_6 C_2)),d,0)","v":0},0,0]
[null,null,null,null,null,null,null,null,"2015-11-09",null,{"$f":"IF(OR(AND(d>V_1 A_1,d<V_1 A_2),AND(d>V_2 A_1,d<V_2 A_2),AND(d>V_3 A_1,d<V_3 A_2),AND(d>V_4 A_1,d<V_4 A_2),AND(d>V_5 A_1,d<V_5 A_2),AND(d>V_6 A_1,d<V_6 A_2)),d,0)","v":0},{"$f":"IF(OR(AND(d>V_1 B_1,d<V_1 B_2),AND(d>V_2 B_1,d<V_2 B_2),AND(d>V_3 B_1,d<V_3 B_2),AND(d>V_4 B_1,d<V_4 B_2),AND(d>V_5 B_1,d<V_5 B_2),AND(d>V_6 B_1,d<V_6 B_2)),d,0)","v":0},{"$f":"IF(OR(AND(d>V_1 C_1,d<V_1 C_2),AND(d>V_2 C_1,d<V_2 C_2),AND(d>V_3 C_1,d<V_3 C_2),AND(d>V_4 C_1,d<V_4 C_2),AND(d>V_5 C_1,d<V_5 C_2),AND(d>V_6 C_1,d<V_6 C_2)),d,0)","v":0},0,{"$f":"INDEX(J138:N138,choix_zone)","v":0}]
[null,null,null,null,null,null,null,null,"2015-11-10",null,{"$f":"IF(OR(AND(d>V_1 A_1,d<V_1 A_2),AND(d>V_2 A_1,d<V_2 A_2),AND(d>V_3 A_1,d<V_3 A_2),AND(d>V_4 A_1,d<V_4 A_2),AND(d>V_5 A_1,d<V_5 A_2),AND(d>V_6 A_1,d<V_6 A_2)),d,0)","v":0},{"$f":"IF(OR(AND(d>V_1 B_1,d<V_1 B_2),AND(d>V_2 B_1,d<V_2 B_2),AND(d>V_3 B_1,d<V_3 B_2),AND(d>V_4 B_1,d<V_4 B_2),AND(d>V_5 B_1,d<V_5 B_2),AND(d>V_6 B_1,d<V_6 B_2)),d,0)","v":0},{"$f":"IF(OR(AND(d>V_1 C_1,d<V_1 C_2),AND(d>V_2 C_1,d<V_2 C_2),AND(d>V_3 C_1,d<V_3 C_2),AND(d>V_4 C_1,d<V_4 C_2),AND(d>V_5 C_1,d<V_5 C_2),AND(d>V_6 C_1,d<V_6 C_2)),d,0)","v":0},0,0]
[null,null,null,null,null,null,null,null,{"$f":"I139+1","v":"2015-11-11"},null,{"$f":"IF(OR(AND(d>V_1 A_1,d<V_1 A_2),AND(d>V_2 A_1,d<V_2 A_2),AND(d>V_3 A_1,d<V_3 A_2),AND(d>V_4 A_1,d<V_4 A_2),AND(d>V_5 A_1,d<V_5 A_2),AND(d>V_6 A_1,d<V_6 A_2)),d,0)","v":0},{"$f":"IF(OR(AND(d>V_1 B_1,d<V_1 B_2),AND(d>V_2 B_1,d<V_2 B_2),AND(d>V_3 B_1,d<V_3 B_2),AND(d>V_4 B_1,d<V_4 B_2),AND(d>V_5 B_1,d<V_5 B_2),AND(d>V_6 B_1,d<V_6 B_2)),d,0)","v":0},{"$f":"IF(OR(AND(d>V_1 C_1,d<V_1 C_2),AND(d>V_2 C_1,d<V_2 C_2),AND(d>V_3 C_1,d<V_3 C_2),AND(d>V_4 C_1,d<V_4 C_2),AND(d>V_5 C_1,d<V_5 C_2),AND(d>V_6 C_1,d<V_6 C_2)),d,0)","v":0},0,0]
[null,null,null,null,null,null,null,null,"2015-11-12",null,{"$f":"IF(OR(AND(d>V_1 A_1,d<V_1 A_2),AND(d>V_2 A_1,d<V_2 A_2),AND(d>V_3 A_1,d<V_3 A_2),AND(d>V_4 A_1,d<V_4 A_2),AND(d>V_5 A_1,d<V_5 A_2),AND(d>V_6 A_1,d<V_6 A_2)),d,0)","v":0},{"$f":"IF(OR(AND(d>V_1 B_1,d<V_1 B_2),AND(d>V_2 B_1,d<V_2 B_2),AND(d>V_3 B_1,d<V_3 B_2),AND(d>V_4 B_1,d<V_4 B_2),AND(d>V_5 B_1,d<V_5 B_2),AND(d>V_6 B_1,d<V_6 B_2)),d,0)","v":0},{"$f":"IF(OR(AND(d>V_1 C_1,d<V_1 C_2),AND(d>V_2 C_1,d<V_2 C_2),AND(d>V_3 C_1,d<V_3 C_2),AND(d>V_4 C_1,d<V_4 C_2),AND(d>V_5 C_1,d<V_5 C_2),AND(d>V_6 C_1,d<V_6 C_2)),d,0)","v":0},0,0]
[null,null,null,null,null,null,null,null,"2015-11-13",null,{"$f":"IF(OR(AND(d>V_1 A_1,d<V_1 A_2),AND(d>V_2 A_1,d<V_2 A_2),AND(d>V_3 A_1,d<V_3 A_2),AND(d>V_4 A_1,d<V_4 A_2),AND(d>V_5 A_1,d<V_5 A_2),AND(d>V_6 A_1,d<V_6 A_2)),d,0)","v":0},{"$f":"IF(OR(AND(d>V_1 B_1,d<V_1 B_2),AND(d>V_2 B_1,d<V_2 B_2),AND(d>V_3 B_1,d<V_3 B_2),AND(d>V_4 B_1,d<V_4 B_2),AND(d>V_5 B_1,d<V_5 B_2),AND(d>V_6 B_1,d<V_6 B_2)),d,0)","v":0},{"$f":"IF(OR(AND(d>V_1 C_1,d<V_1 C_2),AND(d>V_2 C_1,d<V_2 C_2),AND(d>V_3 C_1,d<V_3 C_2),AND(d>V_4 C_1,d<V_4 C_2),AND(d>V_5 C_1,d<V_5 C_2),AND(d>V_6 C_1,d<V_6 C_2)),d,0)","v":0},0,0]
[null,null,null,null,null,null,null,null,"2015-11-14",null,{"$f":"IF(OR(AND(d>V_1 A_1,d<V_1 A_2),AND(d>V_2 A_1,d<V_2 A_2),AND(d>V_3 A_1,d<V_3 A_2),AND(d>V_4 A_1,d<V_4 A_2),AND(d>V_5 A_1,d<V_5 A_2),AND(d>V_6 A_1,d<V_6 A_2)),d,0)","v":0},{"$f":"IF(OR(AND(d>V_1 B_1,d<V_1 B_2),AND(d>V_2 B_1,d<V_2 B_2),AND(d>V_3 B_1,d<V_3 B_2),AND(d>V_4 B_1,d<V_4 B_2),AND(d>V_5 B_1,d<V_5 B_2),AND(d>V_6 B_1,d<V_6 B_2)),d,0)","v":0},{"$f":"IF(OR(AND(d>V_1 C_1,d<V_1 C_2),AND(d>V_2 C_1,d<V_2 C_2),AND(d>V_3 C_1,d<V_3 C_2),AND(d>V_4 C_1,d<V_4 C_2),AND(d>V_5 C_1,d<V_5 C_2),AND(d>V_6 C_1,d<V_6 C_2)),d,0)","v":0},0,0]
[null,null,null,null,null,null,null,null,"2015-11-15",null,{"$f":"IF(OR(AND(d>V_1 A_1,d<V_1 A_2),AND(d>V_2 A_1,d<V_2 A_2),AND(d>V_3 A_1,d<V_3 A_2),AND(d>V_4 A_1,d<V_4 A_2),AND(d>V_5 A_1,d<V_5 A_2),AND(d>V_6 A_1,d<V_6 A_2)),d,0)","v":0},{"$f":"IF(OR(AND(d>V_1 B_1,d<V_1 B_2),AND(d>V_2 B_1,d<V_2 B_2),AND(d>V_3 B_1,d<V_3 B_2),AND(d>V_4 B_1,d<V_4 B_2),AND(d>V_5 B_1,d<V_5 B_2),AND(d>V_6 B_1,d<V_6 B_2)),d,0)","v":0},{"$f":"IF(OR(AND(d>V_1 C_1,d<V_1 C_2),AND(d>V_2 C_1,d<V_2 C_2),AND(d>V_3 C_1,d<V_3 C_2),AND(d>V_4 C_1,d<V_4 C_2),AND(d>V_5 C_1,d<V_5 C_2),AND(d>V_6 C_1,d<V_6 C_2)),d,0)","v":0},{"$f":"MAX(K144:M144)","v":0},0]
[null,null,null,null,null,null,null,null,"2015-11-16",null,{"$f":"IF(OR(AND(d>V_1 A_1,d<V_1 A_2),AND(d>V_2 A_1,d<V_2 A_2),AND(d>V_3 A_1,d<V_3 A_2),AND(d>V_4 A_1,d<V_4 A_2),AND(d>V_5 A_1,d<V_5 A_2),AND(d>V_6 A_1,d<V_6 A_2)),d,0)","v":0},{"$f":"IF(OR(AND(d>V_1 B_1,d<V_1 B_2),AND(d>V_2 B_1,d<V_2 B_2),AND(d>V_3 B_1,d<V_3 B_2),AND(d>V_4 B_1,d<V_4 B_2),AND(d>V_5 B_1,d<V_5 B_2),AND(d>V_6 B_1,d<V_6 B_2)),d,0)","v":0},{"$f":"IF(OR(AND(d>V_1 C_1,d<V_1 C_2),AND(d>V_2 C_1,d<V_2 C_2),AND(d>V_3 C_1,d<V_3 C_2),AND(d>V_4 C_1,d<V_4 C_2),AND(d>V_5 C_1,d<V_5 C_2),AND(d>V_6 C_1,d<V_6 C_2)),d,0)","v":0},0,0]
[null,null,null,null,null,null,null,null,"2015-11-17",null,{"$f":"IF(OR(AND(d>V_1 A_1,d<V_1 A_2),AND(d>V_2 A_1,d<V_2 A_2),AND(d>V_3 A_1,d<V_3 A_2),AND(d>V_4 A_1,d<V_4 A_2),AND(d>V_5 A_1,d<V_5 A_2),AND(d>V_6 A_1,d<V_6 A_2)),d,0)","v":0},{"$f":"IF(OR(AND(d>V_1 B_1,d<V_1 B_2),AND(d>V_2 B_1,d<V_2 B_2),AND(d>V_3 B_1,d<V_3 B_2),AND(d>V_4 B_1,d<V_4 B_2),AND(d>V_5 B_1,d<V_5 B_2),AND(d>V_6 B_1,d<V_6 B_2)),d,0)","v":0},{"$f":"IF(OR(AND(d>V_1 C_1,d<V_1 C_2),AND(d>V_2 C_1,d<V_2 C_2),AND(d>V_3 C_1,d<V_3 C_2),AND(d>V_4 C_1,d<V_4 C_2),AND(d>V_5 C_1,d<V_5 C_2),AND(d>V_6 C_1,d<V_6 C_2)),d,0)","v":0},0,0]
[null,null,null,null,null,null,null,null,"2015-11-18",null,{"$f":"IF(OR(AND(d>V_1 A_1,d<V_1 A_2),AND(d>V_2 A_1,d<V_2 A_2),AND(d>V_3 A_1,d<V_3 A_2),AND(d>V_4 A_1,d<V_4 A_2),AND(d>V_5 A_1,d<V_5 A_2),AND(d>V_6 A_1,d<V_6 A_2)),d,0)","v":0},{"$f":"IF(OR(AND(d>V_1 B_1,d<V_1 B_2),AND(d>V_2 B_1,d<V_2 B_2),AND(d>V_3 B_1,d<V_3 B_2),AND(d>V_4 B_1,d<V_4 B_2),AND(d>V_5 B_1,d<V_5 B_2),AND(d>V_6 B_1,d<V_6 B_2)),d,0)","v":0},{"$f":"IF(OR(AND(d>V_1 C_1,d<V_1 C_2),AND(d>V_2 C_1,d<V_2 C_2),AND(d>V_3 C_1,d<V_3 C_2),AND(d>V_4 C_1,d<V_4 C_2),AND(d>V_5 C_1,d<V_5 C_2),AND(d>V_6 C_1,d<V_6 C_2)),d,0)","v":0},0,0]
[null,null,null,null,null,null,null,null,"2015-11-19",null,{"$f":"IF(OR(AND(d>V_1 A_1,d<V_1 A_2),AND(d>V_2 A_1,d<V_2 A_2),AND(d>V_3 A_1,d<V_3 A_2),AND(d>V_4 A_1,d<V_4 A_2),AND(d>V_5 A_1,d<V_5 A_2),AND(d>V_6 A_1,d<V_6 A_2)),d,0)","v":0},{"$f":"IF(OR(AND(d>V_1 B_1,d<V_1 B_2),AND(d>V_2 B_1,d<V_2 B_2),AND(d>V_3 B_1,d<V_3 B_2),AND(d>V_4 B_1,d<V_4 B_2),AND(d>V_5 B_1,d<V_5 B_2),AND(d>V_6 B_1,d<V_6 B_2)),d,0)","v":0},{"$f":"IF(OR(AND(d>V_1 C_1,d<V_1 C_2),AND(d>V_2 C_1,d<V_2 C_2),AND(d>V_3 C_1,d<V_3 C_2),AND(d>V_4 C_1,d<V_4 C_2),AND(d>V_5 C_1,d<V_5 C_2),AND(d>V_6 C_1,d<V_6 C_2)),d,0)","v":0},0,0]
[null,null,null,null,null,null,null,null,"2015-11-20",null,{"$f":"IF(OR(AND(d>V_1 A_1,d<V_1 A_2),AND(d>V_2 A_1,d<V_2 A_2),AND(d>V_3 A_1,d<V_3 A_2),AND(d>V_4 A_1,d<V_4 A_2),AND(d>V_5 A_1,d<V_5 A_2),AND(d>V_6 A_1,d<V_6 A_2)),d,0)","v":0},{"$f":"IF(OR(AND(d>V_1 B_1,d<V_1 B_2),AND(d>V_2 B_1,d<V_2 B_2),AND(d>V_3 B_1,d<V_3 B_2),AND(d>V_4 B_1,d<V_4 B_2),AND(d>V_5 B_1,d<V_5 B_2),AND(d>V_6 B_1,d<V_6 B_2)),d,0)","v":0},{"$f":"IF(OR(AND(d>V_1 C_1,d<V_1 C_2),AND(d>V_2 C_1,d<V_2 C_2),AND(d>V_3 C_1,d<V_3 C_2),AND(d>V_4 C_1,d<V_4 C_2),AND(d>V_5 C_1,d<V_5 C_2),AND(d>V_6 C_1,d<V_6 C_2)),d,0)","v":0},0,0]
[null,null,null,null,null,null,null,null,"2015-11-21",null,{"$f":"IF(OR(AND(d>V_1 A_1,d<V_1 A_2),AND(d>V_2 A_1,d<V_2 A_2),AND(d>V_3 A_1,d<V_3 A_2),AND(d>V_4 A_1,d<V_4 A_2),AND(d>V_5 A_1,d<V_5 A_2),AND(d>V_6 A_1,d<V_6 A_2)),d,0)","v":0},{"$f":"IF(OR(AND(d>V_1 B_1,d<V_1 B_2),AND(d>V_2 B_1,d<V_2 B_2),AND(d>V_3 B_1,d<V_3 B_2),AND(d>V_4 B_1,d<V_4 B_2),AND(d>V_5 B_1,d<V_5 B_2),AND(d>V_6 B_1,d<V_6 B_2)),d,0)","v":0},{"$f":"IF(OR(AND(d>V_1 C_1,d<V_1 C_2),AND(d>V_2 C_1,d<V_2 C_2),AND(d>V_3 C_1,d<V_3 C_2),AND(d>V_4 C_1,d<V_4 C_2),AND(d>V_5 C_1,d<V_5 C_2),AND(d>V_6 C_1,d<V_6 C_2)),d,0)","v":0},0,0]
[null,null,null,null,null,null,null,null,"2015-11-22",null,{"$f":"IF(OR(AND(d>V_1 A_1,d<V_1 A_2),AND(d>V_2 A_1,d<V_2 A_2),AND(d>V_3 A_1,d<V_3 A_2),AND(d>V_4 A_1,d<V_4 A_2),AND(d>V_5 A_1,d<V_5 A_2),AND(d>V_6 A_1,d<V_6 A_2)),d,0)","v":0},{"$f":"IF(OR(AND(d>V_1 B_1,d<V_1 B_2),AND(d>V_2 B_1,d<V_2 B_2),AND(d>V_3 B_1,d<V_3 B_2),AND(d>V_4 B_1,d<V_4 B_2),AND(d>V_5 B_1,d<V_5 B_2),AND(d>V_6 B_1,d<V_6 B_2)),d,0)","v":0},{"$f":"IF(OR(AND(d>V_1 C_1,d<V_1 C_2),AND(d>V_2 C_1,d<V_2 C_2),AND(d>V_3 C_1,d<V_3 C_2),AND(d>V_4 C_1,d<V_4 C_2),AND(d>V_5 C_1,d<V_5 C_2),AND(d>V_6 C_1,d<V_6 C_2)),d,0)","v":0},{"$f":"MAX(K151:M151)","v":0},0]
[null,null,null,null,null,null,null,null,"2015-11-23",null,{"$f":"IF(OR(AND(d>V_1 A_1,d<V_1 A_2),AND(d>V_2 A_1,d<V_2 A_2),AND(d>V_3 A_1,d<V_3 A_2),AND(d>V_4 A_1,d<V_4 A_2),AND(d>V_5 A_1,d<V_5 A_2),AND(d>V_6 A_1,d<V_6 A_2)),d,0)","v":0},{"$f":"IF(OR(AND(d>V_1 B_1,d<V_1 B_2),AND(d>V_2 B_1,d<V_2 B_2),AND(d>V_3 B_1,d<V_3 B_2),AND(d>V_4 B_1,d<V_4 B_2),AND(d>V_5 B_1,d<V_5 B_2),AND(d>V_6 B_1,d<V_6 B_2)),d,0)","v":0},{"$f":"IF(OR(AND(d>V_1 C_1,d<V_1 C_2),AND(d>V_2 C_1,d<V_2 C_2),AND(d>V_3 C_1,d<V_3 C_2),AND(d>V_4 C_1,d<V_4 C_2),AND(d>V_5 C_1,d<V_5 C_2),AND(d>V_6 C_1,d<V_6 C_2)),d,0)","v":0},0,0]
[null,null,null,null,null,null,null,null,"2015-11-24",null,{"$f":"IF(OR(AND(d>V_1 A_1,d<V_1 A_2),AND(d>V_2 A_1,d<V_2 A_2),AND(d>V_3 A_1,d<V_3 A_2),AND(d>V_4 A_1,d<V_4 A_2),AND(d>V_5 A_1,d<V_5 A_2),AND(d>V_6 A_1,d<V_6 A_2)),d,0)","v":0},{"$f":"IF(OR(AND(d>V_1 B_1,d<V_1 B_2),AND(d>V_2 B_1,d<V_2 B_2),AND(d>V_3 B_1,d<V_3 B_2),AND(d>V_4 B_1,d<V_4 B_2),AND(d>V_5 B_1,d<V_5 B_2),AND(d>V_6 B_1,d<V_6 B_2)),d,0)","v":0},{"$f":"IF(OR(AND(d>V_1 C_1,d<V_1 C_2),AND(d>V_2 C_1,d<V_2 C_2),AND(d>V_3 C_1,d<V_3 C_2),AND(d>V_4 C_1,d<V_4 C_2),AND(d>V_5 C_1,d<V_5 C_2),AND(d>V_6 C_1,d<V_6 C_2)),d,0)","v":0},0,0]
[null,null,null,null,null,null,null,null,"2015-11-25",null,{"$f":"IF(OR(AND(d>V_1 A_1,d<V_1 A_2),AND(d>V_2 A_1,d<V_2 A_2),AND(d>V_3 A_1,d<V_3 A_2),AND(d>V_4 A_1,d<V_4 A_2),AND(d>V_5 A_1,d<V_5 A_2),AND(d>V_6 A_1,d<V_6 A_2)),d,0)","v":0},{"$f":"IF(OR(AND(d>V_1 B_1,d<V_1 B_2),AND(d>V_2 B_1,d<V_2 B_2),AND(d>V_3 B_1,d<V_3 B_2),AND(d>V_4 B_1,d<V_4 B_2),AND(d>V_5 B_1,d<V_5 B_2),AND(d>V_6 B_1,d<V_6 B_2)),d,0)","v":0},{"$f":"IF(OR(AND(d>V_1 C_1,d<V_1 C_2),AND(d>V_2 C_1,d<V_2 C_2),AND(d>V_3 C_1,d<V_3 C_2),AND(d>V_4 C_1,d<V_4 C_2),AND(d>V_5 C_1,d<V_5 C_2),AND(d>V_6 C_1,d<V_6 C_2)),d,0)","v":0},0,0]
[null,null,null,null,null,null,null,null,"2015-11-26",null,{"$f":"IF(OR(AND(d>V_1 A_1,d<V_1 A_2),AND(d>V_2 A_1,d<V_2 A_2),AND(d>V_3 A_1,d<V_3 A_2),AND(d>V_4 A_1,d<V_4 A_2),AND(d>V_5 A_1,d<V_5 A_2),AND(d>V_6 A_1,d<V_6 A_2)),d,0)","v":0},{"$f":"IF(OR(AND(d>V_1 B_1,d<V_1 B_2),AND(d>V_2 B_1,d<V_2 B_2),AND(d>V_3 B_1,d<V_3 B_2),AND(d>V_4 B_1,d<V_4 B_2),AND(d>V_5 B_1,d<V_5 B_2),AND(d>V_6 B_1,d<V_6 B_2)),d,0)","v":0},{"$f":"IF(OR(AND(d>V_1 C_1,d<V_1 C_2),AND(d>V_2 C_1,d<V_2 C_2),AND(d>V_3 C_1,d<V_3 C_2),AND(d>V_4 C_1,d<V_4 C_2),AND(d>V_5 C_1,d<V_5 C_2),AND(d>V_6 C_1,d<V_6 C_2)),d,0)","v":0},0,0]
[null,null,null,null,null,null,null,null,"2015-11-27",null,{"$f":"IF(OR(AND(d>V_1 A_1,d<V_1 A_2),AND(d>V_2 A_1,d<V_2 A_2),AND(d>V_3 A_1,d<V_3 A_2),AND(d>V_4 A_1,d<V_4 A_2),AND(d>V_5 A_1,d<V_5 A_2),AND(d>V_6 A_1,d<V_6 A_2)),d,0)","v":0},{"$f":"IF(OR(AND(d>V_1 B_1,d<V_1 B_2),AND(d>V_2 B_1,d<V_2 B_2),AND(d>V_3 B_1,d<V_3 B_2),AND(d>V_4 B_1,d<V_4 B_2),AND(d>V_5 B_1,d<V_5 B_2),AND(d>V_6 B_1,d<V_6 B_2)),d,0)","v":0},{"$f":"IF(OR(AND(d>V_1 C_1,d<V_1 C_2),AND(d>V_2 C_1,d<V_2 C_2),AND(d>V_3 C_1,d<V_3 C_2),AND(d>V_4 C_1,d<V_4 C_2),AND(d>V_5 C_1,d<V_5 C_2),AND(d>V_6 C_1,d<V_6 C_2)),d,0)","v":0},0,0]
[null,null,null,null,null,null,null,null,"2015-11-28",null,{"$f":"IF(OR(AND(d>V_1 A_1,d<V_1 A_2),AND(d>V_2 A_1,d<V_2 A_2),AND(d>V_3 A_1,d<V_3 A_2),AND(d>V_4 A_1,d<V_4 A_2),AND(d>V_5 A_1,d<V_5 A_2),AND(d>V_6 A_1,d<V_6 A_2)),d,0)","v":0},{"$f":"IF(OR(AND(d>V_1 B_1,d<V_1 B_2),AND(d>V_2 B_1,d<V_2 B_2),AND(d>V_3 B_1,d<V_3 B_2),AND(d>V_4 B_1,d<V_4 B_2),AND(d>V_5 B_1,d<V_5 B_2),AND(d>V_6 B_1,d<V_6 B_2)),d,0)","v":0},{"$f":"IF(OR(AND(d>V_1 C_1,d<V_1 C_2),AND(d>V_2 C_1,d<V_2 C_2),AND(d>V_3 C_1,d<V_3 C_2),AND(d>V_4 C_1,d<V_4 C_2),AND(d>V_5 C_1,d<V_5 C_2),AND(d>V_6 C_1,d<V_6 C_2)),d,0)","v":0},0,0]
[null,null,null,null,null,null,null,null,"2015-11-29",null,{"$f":"IF(OR(AND(d>V_1 A_1,d<V_1 A_2),AND(d>V_2 A_1,d<V_2 A_2),AND(d>V_3 A_1,d<V_3 A_2),AND(d>V_4 A_1,d<V_4 A_2),AND(d>V_5 A_1,d<V_5 A_2),AND(d>V_6 A_1,d<V_6 A_2)),d,0)","v":0},{"$f":"IF(OR(AND(d>V_1 B_1,d<V_1 B_2),AND(d>V_2 B_1,d<V_2 B_2),AND(d>V_3 B_1,d<V_3 B_2),AND(d>V_4 B_1,d<V_4 B_2),AND(d>V_5 B_1,d<V_5 B_2),AND(d>V_6 B_1,d<V_6 B_2)),d,0)","v":0},{"$f":"IF(OR(AND(d>V_1 C_1,d<V_1 C_2),AND(d>V_2 C_1,d<V_2 C_2),AND(d>V_3 C_1,d<V_3 C_2),AND(d>V_4 C_1,d<V_4 C_2),AND(d>V_5 C_1,d<V_5 C_2),AND(d>V_6 C_1,d<V_6 C_2)),d,0)","v":0},0,0]
[null,null,null,null,null,null,null,null,"2015-11-30",null,{"$f":"IF(OR(AND(d>V_1 A_1,d<V_1 A_2),AND(d>V_2 A_1,d<V_2 A_2),AND(d>V_3 A_1,d<V_3 A_2),AND(d>V_4 A_1,d<V_4 A_2),AND(d>V_5 A_1,d<V_5 A_2),AND(d>V_6 A_1,d<V_6 A_2)),d,0)","v":0},{"$f":"IF(OR(AND(d>V_1 B_1,d<V_1 B_2),AND(d>V_2 B_1,d<V_2 B_2),AND(d>V_3 B_1,d<V_3 B_2),AND(d>V_4 B_1,d<V_4 B_2),AND(d>V_5 B_1,d<V_5 B_2),AND(d>V_6 B_1,d<V_6 B_2)),d,0)","v":0},{"$f":"IF(OR(AND(d>V_1 C_1,d<V_1 C_2),AND(d>V_2 C_1,d<V_2 C_2),AND(d>V_3 C_1,d<V_3 C_2),AND(d>V_4 C_1,d<V_4 C_2),AND(d>V_5 C_1,d<V_5 C_2),AND(d>V_6 C_1,d<V_6 C_2)),d,0)","v":0},0,0]
[null,null,null,null,null,null,null,null,"2015-12-01",null,{"$f":"IF(OR(AND(d>V_1 A_1,d<V_1 A_2),AND(d>V_2 A_1,d<V_2 A_2),AND(d>V_3 A_1,d<V_3 A_2),AND(d>V_4 A_1,d<V_4 A_2),AND(d>V_5 A_1,d<V_5 A_2),AND(d>V_6 A_1,d<V_6 A_2)),d,0)","v":0},{"$f":"IF(OR(AND(d>V_1 B_1,d<V_1 B_2),AND(d>V_2 B_1,d<V_2 B_2),AND(d>V_3 B_1,d<V_3 B_2),AND(d>V_4 B_1,d<V_4 B_2),AND(d>V_5 B_1,d<V_5 B_2),AND(d>V_6 B_1,d<V_6 B_2)),d,0)","v":0},{"$f":"IF(OR(AND(d>V_1 C_1,d<V_1 C_2),AND(d>V_2 C_1,d<V_2 C_2),AND(d>V_3 C_1,d<V_3 C_2),AND(d>V_4 C_1,d<V_4 C_2),AND(d>V_5 C_1,d<V_5 C_2),AND(d>V_6 C_1,d<V_6 C_2)),d,0)","v":0},0,0]
[null,null,null,null,null,null,null,null,"2015-12-02",null,{"$f":"IF(OR(AND(d>V_1 A_1,d<V_1 A_2),AND(d>V_2 A_1,d<V_2 A_2),AND(d>V_3 A_1,d<V_3 A_2),AND(d>V_4 A_1,d<V_4 A_2),AND(d>V_5 A_1,d<V_5 A_2),AND(d>V_6 A_1,d<V_6 A_2)),d,0)","v":0},{"$f":"IF(OR(AND(d>V_1 B_1,d<V_1 B_2),AND(d>V_2 B_1,d<V_2 B_2),AND(d>V_3 B_1,d<V_3 B_2),AND(d>V_4 B_1,d<V_4 B_2),AND(d>V_5 B_1,d<V_5 B_2),AND(d>V_6 B_1,d<V_6 B_2)),d,0)","v":0},{"$f":"IF(OR(AND(d>V_1 C_1,d<V_1 C_2),AND(d>V_2 C_1,d<V_2 C_2),AND(d>V_3 C_1,d<V_3 C_2),AND(d>V_4 C_1,d<V_4 C_2),AND(d>V_5 C_1,d<V_5 C_2),AND(d>V_6 C_1,d<V_6 C_2)),d,0)","v":0},0,0]
[null,null,null,null,null,null,null,null,"2015-12-03",null,{"$f":"IF(OR(AND(d>V_1 A_1,d<V_1 A_2),AND(d>V_2 A_1,d<V_2 A_2),AND(d>V_3 A_1,d<V_3 A_2),AND(d>V_4 A_1,d<V_4 A_2),AND(d>V_5 A_1,d<V_5 A_2),AND(d>V_6 A_1,d<V_6 A_2)),d,0)","v":0},{"$f":"IF(OR(AND(d>V_1 B_1,d<V_1 B_2),AND(d>V_2 B_1,d<V_2 B_2),AND(d>V_3 B_1,d<V_3 B_2),AND(d>V_4 B_1,d<V_4 B_2),AND(d>V_5 B_1,d<V_5 B_2),AND(d>V_6 B_1,d<V_6 B_2)),d,0)","v":0},{"$f":"IF(OR(AND(d>V_1 C_1,d<V_1 C_2),AND(d>V_2 C_1,d<V_2 C_2),AND(d>V_3 C_1,d<V_3 C_2),AND(d>V_4 C_1,d<V_4 C_2),AND(d>V_5 C_1,d<V_5 C_2),AND(d>V_6 C_1,d<V_6 C_2)),d,0)","v":0},0,0]
[null,null,null,null,null,null,null,null,"2015-12-04",null,{"$f":"IF(OR(AND(d>V_1 A_1,d<V_1 A_2),AND(d>V_2 A_1,d<V_2 A_2),AND(d>V_3 A_1,d<V_3 A_2),AND(d>V_4 A_1,d<V_4 A_2),AND(d>V_5 A_1,d<V_5 A_2),AND(d>V_6 A_1,d<V_6 A_2)),d,0)","v":0},{"$f":"IF(OR(AND(d>V_1 B_1,d<V_1 B_2),AND(d>V_2 B_1,d<V_2 B_2),AND(d>V_3 B_1,d<V_3 B_2),AND(d>V_4 B_1,d<V_4 B_2),AND(d>V_5 B_1,d<V_5 B_2),AND(d>V_6 B_1,d<V_6 B_2)),d,0)","v":0},{"$f":"IF(OR(AND(d>V_1 C_1,d<V_1 C_2),AND(d>V_2 C_1,d<V_2 C_2),AND(d>V_3 C_1,d<V_3 C_2),AND(d>V_4 C_1,d<V_4 C_2),AND(d>V_5 C_1,d<V_5 C_2),AND(d>V_6 C_1,d<V_6 C_2)),d,0)","v":0},0,0]
[null,null,null,null,null,null,null,null,"2015-12-05",null,{"$f":"IF(OR(AND(d>V_1 A_1,d<V_1 A_2),AND(d>V_2 A_1,d<V_2 A_2),AND(d>V_3 A_1,d<V_3 A_2),AND(d>V_4 A_1,d<V_4 A_2),AND(d>V_5 A_1,d<V_5 A_2),AND(d>V_6 A_1,d<V_6 A_2)),d,0)","v":0},{"$f":"IF(OR(AND(d>V_1 B_1,d<V_1 B_2),AND(d>V_2 B_1,d<V_2 B_2),AND(d>V_3 B_1,d<V_3 B_2),AND(d>V_4 B_1,d<V_4 B_2),AND(d>V_5 B_1,d<V_5 B_2),AND(d>V_6 B_1,d<V_6 B_2)),d,0)","v":0},{"$f":"IF(OR(AND(d>V_1 C_1,d<V_1 C_2),AND(d>V_2 C_1,d<V_2 C_2),AND(d>V_3 C_1,d<V_3 C_2),AND(d>V_4 C_1,d<V_4 C_2),AND(d>V_5 C_1,d<V_5 C_2),AND(d>V_6 C_1,d<V_6 C_2)),d,0)","v":0},0,0]
[null,null,null,null,null,null,null,null,"2015-12-06",null,{"$f":"IF(OR(AND(d>V_1 A_1,d<V_1 A_2),AND(d>V_2 A_1,d<V_2 A_2),AND(d>V_3 A_1,d<V_3 A_2),AND(d>V_4 A_1,d<V_4 A_2),AND(d>V_5 A_1,d<V_5 A_2),AND(d>V_6 A_1,d<V_6 A_2)),d,0)","v":0},{"$f":"IF(OR(AND(d>V_1 B_1,d<V_1 B_2),AND(d>V_2 B_1,d<V_2 B_2),AND(d>V_3 B_1,d<V_3 B_2),AND(d>V_4 B_1,d<V_4 B_2),AND(d>V_5 B_1,d<V_5 B_2),AND(d>V_6 B_1,d<V_6 B_2)),d,0)","v":0},{"$f":"IF(OR(AND(d>V_1 C_1,d<V_1 C_2),AND(d>V_2 C_1,d<V_2 C_2),AND(d>V_3 C_1,d<V_3 C_2),AND(d>V_4 C_1,d<V_4 C_2),AND(d>V_5 C_1,d<V_5 C_2),AND(d>V_6 C_1,d<V_6 C_2)),d,0)","v":0},0,0]
[null,null,null,null,null,null,null,null,"2015-12-07",null,{"$f":"IF(OR(AND(d>V_1 A_1,d<V_1 A_2),AND(d>V_2 A_1,d<V_2 A_2),AND(d>V_3 A_1,d<V_3 A_2),AND(d>V_4 A_1,d<V_4 A_2),AND(d>V_5 A_1,d<V_5 A_2),AND(d>V_6 A_1,d<V_6 A_2)),d,0)","v":0},{"$f":"IF(OR(AND(d>V_1 B_1,d<V_1 B_2),AND(d>V_2 B_1,d<V_2 B_2),AND(d>V_3 B_1,d<V_3 B_2),AND(d>V_4 B_1,d<V_4 B_2),AND(d>V_5 B_1,d<V_5 B_2),AND(d>V_6 B_1,d<V_6 B_2)),d,0)","v":0},{"$f":"IF(OR(AND(d>V_1 C_1,d<V_1 C_2),AND(d>V_2 C_1,d<V_2 C_2),AND(d>V_3 C_1,d<V_3 C_2),AND(d>V_4 C_1,d<V_4 C_2),AND(d>V_5 C_1,d<V_5 C_2),AND(d>V_6 C_1,d<V_6 C_2)),d,0)","v":0},0,0]
[null,null,null,null,null,null,null,null,"2015-12-08",null,{"$f":"IF(OR(AND(d>V_1 A_1,d<V_1 A_2),AND(d>V_2 A_1,d<V_2 A_2),AND(d>V_3 A_1,d<V_3 A_2),AND(d>V_4 A_1,d<V_4 A_2),AND(d>V_5 A_1,d<V_5 A_2),AND(d>V_6 A_1,d<V_6 A_2)),d,0)","v":0},{"$f":"IF(OR(AND(d>V_1 B_1,d<V_1 B_2),AND(d>V_2 B_1,d<V_2 B_2),AND(d>V_3 B_1,d<V_3 B_2),AND(d>V_4 B_1,d<V_4 B_2),AND(d>V_5 B_1,d<V_5 B_2),AND(d>V_6 B_1,d<V_6 B_2)),d,0)","v":0},{"$f":"IF(OR(AND(d>V_1 C_1,d<V_1 C_2),AND(d>V_2 C_1,d<V_2 C_2),AND(d>V_3 C_1,d<V_3 C_2),AND(d>V_4 C_1,d<V_4 C_2),AND(d>V_5 C_1,d<V_5 C_2),AND(d>V_6 C_1,d<V_6 C_2)),d,0)","v":0},0,0]
[null,null,null,null,null,null,null,null,"2015-12-09",null,{"$f":"IF(OR(AND(d>V_1 A_1,d<V_1 A_2),AND(d>V_2 A_1,d<V_2 A_2),AND(d>V_3 A_1,d<V_3 A_2),AND(d>V_4 A_1,d<V_4 A_2),AND(d>V_5 A_1,d<V_5 A_2),AND(d>V_6 A_1,d<V_6 A_2)),d,0)","v":0},{"$f":"IF(OR(AND(d>V_1 B_1,d<V_1 B_2),AND(d>V_2 B_1,d<V_2 B_2),AND(d>V_3 B_1,d<V_3 B_2),AND(d>V_4 B_1,d<V_4 B_2),AND(d>V_5 B_1,d<V_5 B_2),AND(d>V_6 B_1,d<V_6 B_2)),d,0)","v":0},{"$f":"IF(OR(AND(d>V_1 C_1,d<V_1 C_2),AND(d>V_2 C_1,d<V_2 C_2),AND(d>V_3 C_1,d<V_3 C_2),AND(d>V_4 C_1,d<V_4 C_2),AND(d>V_5 C_1,d<V_5 C_2),AND(d>V_6 C_1,d<V_6 C_2)),d,0)","v":0},0,0]
[null,null,null,null,null,null,null,null,"2015-12-10",null,{"$f":"IF(OR(AND(d>V_1 A_1,d<V_1 A_2),AND(d>V_2 A_1,d<V_2 A_2),AND(d>V_3 A_1,d<V_3 A_2),AND(d>V_4 A_1,d<V_4 A_2),AND(d>V_5 A_1,d<V_5 A_2),AND(d>V_6 A_1,d<V_6 A_2)),d,0)","v":0},{"$f":"IF(OR(AND(d>V_1 B_1,d<V_1 B_2),AND(d>V_2 B_1,d<V_2 B_2),AND(d>V_3 B_1,d<V_3 B_2),AND(d>V_4 B_1,d<V_4 B_2),AND(d>V_5 B_1,d<V_5 B_2),AND(d>V_6 B_1,d<V_6 B_2)),d,0)","v":0},{"$f":"IF(OR(AND(d>V_1 C_1,d<V_1 C_2),AND(d>V_2 C_1,d<V_2 C_2),AND(d>V_3 C_1,d<V_3 C_2),AND(d>V_4 C_1,d<V_4 C_2),AND(d>V_5 C_1,d<V_5 C_2),AND(d>V_6 C_1,d<V_6 C_2)),d,0)","v":0},0,0]
[null,null,null,null,null,null,null,null,"2015-12-11",null,{"$f":"IF(OR(AND(d>V_1 A_1,d<V_1 A_2),AND(d>V_2 A_1,d<V_2 A_2),AND(d>V_3 A_1,d<V_3 A_2),AND(d>V_4 A_1,d<V_4 A_2),AND(d>V_5 A_1,d<V_5 A_2),AND(d>V_6 A_1,d<V_6 A_2)),d,0)","v":0},{"$f":"IF(OR(AND(d>V_1 B_1,d<V_1 B_2),AND(d>V_2 B_1,d<V_2 B_2),AND(d>V_3 B_1,d<V_3 B_2),AND(d>V_4 B_1,d<V_4 B_2),AND(d>V_5 B_1,d<V_5 B_2),AND(d>V_6 B_1,d<V_6 B_2)),d,0)","v":0},{"$f":"IF(OR(AND(d>V_1 C_1,d<V_1 C_2),AND(d>V_2 C_1,d<V_2 C_2),AND(d>V_3 C_1,d<V_3 C_2),AND(d>V_4 C_1,d<V_4 C_2),AND(d>V_5 C_1,d<V_5 C_2),AND(d>V_6 C_1,d<V_6 C_2)),d,0)","v":0},0,0]
[null,null,null,null,null,null,null,null,"2015-12-12",null,{"$f":"IF(OR(AND(d>V_1 A_1,d<V_1 A_2),AND(d>V_2 A_1,d<V_2 A_2),AND(d>V_3 A_1,d<V_3 A_2),AND(d>V_4 A_1,d<V_4 A_2),AND(d>V_5 A_1,d<V_5 A_2),AND(d>V_6 A_1,d<V_6 A_2)),d,0)","v":0},{"$f":"IF(OR(AND(d>V_1 B_1,d<V_1 B_2),AND(d>V_2 B_1,d<V_2 B_2),AND(d>V_3 B_1,d<V_3 B_2),AND(d>V_4 B_1,d<V_4 B_2),AND(d>V_5 B_1,d<V_5 B_2),AND(d>V_6 B_1,d<V_6 B_2)),d,0)","v":0},{"$f":"IF(OR(AND(d>V_1 C_1,d<V_1 C_2),AND(d>V_2 C_1,d<V_2 C_2),AND(d>V_3 C_1,d<V_3 C_2),AND(d>V_4 C_1,d<V_4 C_2),AND(d>V_5 C_1,d<V_5 C_2),AND(d>V_6 C_1,d<V_6 C_2)),d,0)","v":0},0,0]
[null,null,null,null,null,null,null,null,"2015-12-13",null,{"$f":"IF(OR(AND(d>V_1 A_1,d<V_1 A_2),AND(d>V_2 A_1,d<V_2 A_2),AND(d>V_3 A_1,d<V_3 A_2),AND(d>V_4 A_1,d<V_4 A_2),AND(d>V_5 A_1,d<V_5 A_2),AND(d>V_6 A_1,d<V_6 A_2)),d,0)","v":0},{"$f":"IF(OR(AND(d>V_1 B_1,d<V_1 B_2),AND(d>V_2 B_1,d<V_2 B_2),AND(d>V_3 B_1,d<V_3 B_2),AND(d>V_4 B_1,d<V_4 B_2),AND(d>V_5 B_1,d<V_5 B_2),AND(d>V_6 B_1,d<V_6 B_2)),d,0)","v":0},{"$f":"IF(OR(AND(d>V_1 C_1,d<V_1 C_2),AND(d>V_2 C_1,d<V_2 C_2),AND(d>V_3 C_1,d<V_3 C_2),AND(d>V_4 C_1,d<V_4 C_2),AND(d>V_5 C_1,d<V_5 C_2),AND(d>V_6 C_1,d<V_6 C_2)),d,0)","v":0},0,0]
[null,null,null,null,null,null,null,null,"2015-12-14",null,{"$f":"IF(OR(AND(d>V_1 A_1,d<V_1 A_2),AND(d>V_2 A_1,d<V_2 A_2),AND(d>V_3 A_1,d<V_3 A_2),AND(d>V_4 A_1,d<V_4 A_2),AND(d>V_5 A_1,d<V_5 A_2),AND(d>V_6 A_1,d<V_6 A_2)),d,0)","v":0},{"$f":"IF(OR(AND(d>V_1 B_1,d<V_1 B_2),AND(d>V_2 B_1,d<V_2 B_2),AND(d>V_3 B_1,d<V_3 B_2),AND(d>V_4 B_1,d<V_4 B_2),AND(d>V_5 B_1,d<V_5 B_2),AND(d>V_6 B_1,d<V_6 B_2)),d,0)","v":0},{"$f":"IF(OR(AND(d>V_1 C_1,d<V_1 C_2),AND(d>V_2 C_1,d<V_2 C_2),AND(d>V_3 C_1,d<V_3 C_2),AND(d>V_4 C_1,d<V_4 C_2),AND(d>V_5 C_1,d<V_5 C_2),AND(d>V_6 C_1,d<V_6 C_2)),d,0)","v":0},0,0]
[null,null,null,null,null,null,null,null,"2015-12-15",null,{"$f":"IF(OR(AND(d>V_1 A_1,d<V_1 A_2),AND(d>V_2 A_1,d<V_2 A_2),AND(d>V_3 A_1,d<V_3 A_2),AND(d>V_4 A_1,d<V_4 A_2),AND(d>V_5 A_1,d<V_5 A_2),AND(d>V_6 A_1,d<V_6 A_2)),d,0)","v":0},{"$f":"IF(OR(AND(d>V_1 B_1,d<V_1 B_2),AND(d>V_2 B_1,d<V_2 B_2),AND(d>V_3 B_1,d<V_3 B_2),AND(d>V_4 B_1,d<V_4 B_2),AND(d>V_5 B_1,d<V_5 B_2),AND(d>V_6 B_1,d<V_6 B_2)),d,0)","v":0},{"$f":"IF(OR(AND(d>V_1 C_1,d<V_1 C_2),AND(d>V_2 C_1,d<V_2 C_2),AND(d>V_3 C_1,d<V_3 C_2),AND(d>V_4 C_1,d<V_4 C_2),AND(d>V_5 C_1,d<V_5 C_2),AND(d>V_6 C_1,d<V_6 C_2)),d,0)","v":0},0,0]
[null,null,null,null,null,null,null,null,"2015-12-16",null,{"$f":"IF(OR(AND(d>V_1 A_1,d<V_1 A_2),AND(d>V_2 A_1,d<V_2 A_2),AND(d>V_3 A_1,d<V_3 A_2),AND(d>V_4 A_1,d<V_4 A_2),AND(d>V_5 A_1,d<V_5 A_2),AND(d>V_6 A_1,d<V_6 A_2)),d,0)","v":0},{"$f":"IF(OR(AND(d>V_1 B_1,d<V_1 B_2),AND(d>V_2 B_1,d<V_2 B_2),AND(d>V_3 B_1,d<V_3 B_2),AND(d>V_4 B_1,d<V_4 B_2),AND(d>V_5 B_1,d<V_5 B_2),AND(d>V_6 B_1,d<V_6 B_2)),d,0)","v":0},{"$f":"IF(OR(AND(d>V_1 C_1,d<V_1 C_2),AND(d>V_2 C_1,d<V_2 C_2),AND(d>V_3 C_1,d<V_3 C_2),AND(d>V_4 C_1,d<V_4 C_2),AND(d>V_5 C_1,d<V_5 C_2),AND(d>V_6 C_1,d<V_6 C_2)),d,0)","v":0},0,0]
[null,null,null,null,null,null,null,null,"2015-12-17",null,{"$f":"IF(OR(AND(d>V_1 A_1,d<V_1 A_2),AND(d>V_2 A_1,d<V_2 A_2),AND(d>V_3 A_1,d<V_3 A_2),AND(d>V_4 A_1,d<V_4 A_2),AND(d>V_5 A_1,d<V_5 A_2),AND(d>V_6 A_1,d<V_6 A_2)),d,0)","v":0},{"$f":"IF(OR(AND(d>V_1 B_1,d<V_1 B_2),AND(d>V_2 B_1,d<V_2 B_2),AND(d>V_3 B_1,d<V_3 B_2),AND(d>V_4 B_1,d<V_4 B_2),AND(d>V_5 B_1,d<V_5 B_2),AND(d>V_6 B_1,d<V_6 B_2)),d,0)","v":0},{"$f":"IF(OR(AND(d>V_1 C_1,d<V_1 C_2),AND(d>V_2 C_1,d<V_2 C_2),AND(d>V_3 C_1,d<V_3 C_2),AND(d>V_4 C_1,d<V_4 C_2),AND(d>V_5 C_1,d<V_5 C_2),AND(d>V_6 C_1,d<V_6 C_2)),d,0)","v":0},0,0]
[null,null,null,null,null,null,null,null,"2015-12-18",null,{"$f":"IF(OR(AND(d>V_1 A_1,d<V_1 A_2),AND(d>V_2 A_1,d<V_2 A_2),AND(d>V_3 A_1,d<V_3 A_2),AND(d>V_4 A_1,d<V_4 A_2),AND(d>V_5 A_1,d<V_5 A_2),AND(d>V_6 A_1,d<V_6 A_2)),d,0)","v":0},{"$f":"IF(OR(AND(d>V_1 B_1,d<V_1 B_2),AND(d>V_2 B_1,d<V_2 B_2),AND(d>V_3 B_1,d<V_3 B_2),AND(d>V_4 B_1,d<V_4 B_2),AND(d>V_5 B_1,d<V_5 B_2),AND(d>V_6 B_1,d<V_6 B_2)),d,0)","v":0},{"$f":"IF(OR(AND(d>V_1 C_1,d<V_1 C_2),AND(d>V_2 C_1,d<V_2 C_2),AND(d>V_3 C_1,d<V_3 C_2),AND(d>V_4 C_1,d<V_4 C_2),AND(d>V_5 C_1,d<V_5 C_2),AND(d>V_6 C_1,d<V_6 C_2)),d,0)","v":0},0,0]
[null,null,null,null,null,null,null,null,"2015-12-19",null,{"$f":"IF(OR(AND(d>V_1 A_1,d<V_1 A_2),AND(d>V_2 A_1,d<V_2 A_2),AND(d>V_3 A_1,d<V_3 A_2),AND(d>V_4 A_1,d<V_4 A_2),AND(d>V_5 A_1,d<V_5 A_2),AND(d>V_6 A_1,d<V_6 A_2)),d,0)","v":0},{"$f":"IF(OR(AND(d>V_1 B_1,d<V_1 B_2),AND(d>V_2 B_1,d<V_2 B_2),AND(d>V_3 B_1,d<V_3 B_2),AND(d>V_4 B_1,d<V_4 B_2),AND(d>V_5 B_1,d<V_5 B_2),AND(d>V_6 B_1,d<V_6 B_2)),d,0)","v":0},{"$f":"IF(OR(AND(d>V_1 C_1,d<V_1 C_2),AND(d>V_2 C_1,d<V_2 C_2),AND(d>V_3 C_1,d<V_3 C_2),AND(d>V_4 C_1,d<V_4 C_2),AND(d>V_5 C_1,d<V_5 C_2),AND(d>V_6 C_1,d<V_6 C_2)),d,0)","v":0},0,0]
[null,null,null,null,null,null,null,null,"2015-12-20",null,{"$f":"IF(OR(AND(d>V_1 A_1,d<V_1 A_2),AND(d>V_2 A_1,d<V_2 A_2),AND(d>V_3 A_1,d<V_3 A_2),AND(d>V_4 A_1,d<V_4 A_2),AND(d>V_5 A_1,d<V_5 A_2),AND(d>V_6 A_1,d<V_6 A_2)),d,0)","v":42358},{"$f":"IF(OR(AND(d>V_1 B_1,d<V_1 B_2),AND(d>V_2 B_1,d<V_2 B_2),AND(d>V_3 B_1,d<V_3 B_2),AND(d>V_4 B_1,d<V_4 B_2),AND(d>V_5 B_1,d<V_5 B_2),AND(d>V_6 B_1,d<V_6 B_2)),d,0)","v":42358},{"$f":"IF(OR(AND(d>V_1 C_1,d<V_1 C_2),AND(d>V_2 C_1,d<V_2 C_2),AND(d>V_3 C_1,d<V_3 C_2),AND(d>V_4 C_1,d<V_4 C_2),AND(d>V_5 C_1,d<V_5 C_2),AND(d>V_6 C_1,d<V_6 C_2)),d,0)","v":42358},42358,42358]
[null,null,null,null,null,null,null,null,"2015-12-21",null,{"$f":"IF(OR(AND(d>V_1 A_1,d<V_1 A_2),AND(d>V_2 A_1,d<V_2 A_2),AND(d>V_3 A_1,d<V_3 A_2),AND(d>V_4 A_1,d<V_4 A_2),AND(d>V_5 A_1,d<V_5 A_2),AND(d>V_6 A_1,d<V_6 A_2)),d,0)","v":42359},{"$f":"IF(OR(AND(d>V_1 B_1,d<V_1 B_2),AND(d>V_2 B_1,d<V_2 B_2),AND(d>V_3 B_1,d<V_3 B_2),AND(d>V_4 B_1,d<V_4 B_2),AND(d>V_5 B_1,d<V_5 B_2),AND(d>V_6 B_1,d<V_6 B_2)),d,0)","v":42359},{"$f":"IF(OR(AND(d>V_1 C_1,d<V_1 C_2),AND(d>V_2 C_1,d<V_2 C_2),AND(d>V_3 C_1,d<V_3 C_2),AND(d>V_4 C_1,d<V_4 C_2),AND(d>V_5 C_1,d<V_5 C_2),AND(d>V_6 C_1,d<V_6 C_2)),d,0)","v":42359},42359,42359]
[null,null,null,null,null,null,null,null,"2015-12-22",null,{"$f":"IF(OR(AND(d>V_1 A_1,d<V_1 A_2),AND(d>V_2 A_1,d<V_2 A_2),AND(d>V_3 A_1,d<V_3 A_2),AND(d>V_4 A_1,d<V_4 A_2),AND(d>V_5 A_1,d<V_5 A_2),AND(d>V_6 A_1,d<V_6 A_2)),d,0)","v":42360},{"$f":"IF(OR(AND(d>V_1 B_1,d<V_1 B_2),AND(d>V_2 B_1,d<V_2 B_2),AND(d>V_3 B_1,d<V_3 B_2),AND(d>V_4 B_1,d<V_4 B_2),AND(d>V_5 B_1,d<V_5 B_2),AND(d>V_6 B_1,d<V_6 B_2)),d,0)","v":42360},{"$f":"IF(OR(AND(d>V_1 C_1,d<V_1 C_2),AND(d>V_2 C_1,d<V_2 C_2),AND(d>V_3 C_1,d<V_3 C_2),AND(d>V_4 C_1,d<V_4 C_2),AND(d>V_5 C_1,d<V_5 C_2),AND(d>V_6 C_1,d<V_6 C_2)),d,0)","v":42360},42360,42360]
[null,null,null,null,null,null,null,null,"2015-12-23",null,{"$f":"IF(OR(AND(d>V_1 A_1,d<V_1 A_2),AND(d>V_2 A_1,d<V_2 A_2),AND(d>V_3 A_1,d<V_3 A_2),AND(d>V_4 A_1,d<V_4 A_2),AND(d>V_5 A_1,d<V_5 A_2),AND(d>V_6 A_1,d<V_6 A_2)),d,0)","v":42361},{"$f":"IF(OR(AND(d>V_1 B_1,d<V_1 B_2),AND(d>V_2 B_1,d<V_2 B_2),AND(d>V_3 B_1,d<V_3 B_2),AND(d>V_4 B_1,d<V_4 B_2),AND(d>V_5 B_1,d<V_5 B_2),AND(d>V_6 B_1,d<V_6 B_2)),d,0)","v":42361},{"$f":"IF(OR(AND(d>V_1 C_1,d<V_1 C_2),AND(d>V_2 C_1,d<V_2 C_2),AND(d>V_3 C_1,d<V_3 C_2),AND(d>V_4 C_1,d<V_4 C_2),AND(d>V_5 C_1,d<V_5 C_2),AND(d>V_6 C_1,d<V_6 C_2)),d,0)","v":42361},42361,42361]
[null,null,null,null,null,null,null,null,"2015-12-24",null,{"$f":"IF(OR(AND(d>V_1 A_1,d<V_1 A_2),AND(d>V_2 A_1,d<V_2 A_2),AND(d>V_3 A_1,d<V_3 A_2),AND(d>V_4 A_1,d<V_4 A_2),AND(d>V_5 A_1,d<V_5 A_2),AND(d>V_6 A_1,d<V_6 A_2)),d,0)","v":42362},{"$f":"IF(OR(AND(d>V_1 B_1,d<V_1 B_2),AND(d>V_2 B_1,d<V_2 B_2),AND(d>V_3 B_1,d<V_3 B_2),AND(d>V_4 B_1,d<V_4 B_2),AND(d>V_5 B_1,d<V_5 B_2),AND(d>V_6 B_1,d<V_6 B_2)),d,0)","v":42362},{"$f":"IF(OR(AND(d>V_1 C_1,d<V_1 C_2),AND(d>V_2 C_1,d<V_2 C_2),AND(d>V_3 C_1,d<V_3 C_2),AND(d>V_4 C_1,d<V_4 C_2),AND(d>V_5 C_1,d<V_5 C_2),AND(d>V_6 C_1,d<V_6 C_2)),d,0)","v":42362},42362,42362]
[null,null,null,null,null,null,null,null,"2015-12-25",null,{"$f":"IF(OR(AND(d>V_1 A_1,d<V_1 A_2),AND(d>V_2 A_1,d<V_2 A_2),AND(d>V_3 A_1,d<V_3 A_2),AND(d>V_4 A_1,d<V_4 A_2),AND(d>V_5 A_1,d<V_5 A_2),AND(d>V_6 A_1,d<V_6 A_2)),d,0)","v":42363},{"$f":"IF(OR(AND(d>V_1 B_1,d<V_1 B_2),AND(d>V_2 B_1,d<V_2 B_2),AND(d>V_3 B_1,d<V_3 B_2),AND(d>V_4 B_1,d<V_4 B_2),AND(d>V_5 B_1,d<V_5 B_2),AND(d>V_6 B_1,d<V_6 B_2)),d,0)","v":42363},{"$f":"IF(OR(AND(d>V_1 C_1,d<V_1 C_2),AND(d>V_2 C_1,d<V_2 C_2),AND(d>V_3 C_1,d<V_3 C_2),AND(d>V_4 C_1,d<V_4 C_2),AND(d>V_5 C_1,d<V_5 C_2),AND(d>V_6 C_1,d<V_6 C_2)),d,0)","v":42363},42363,42363]
[null,null,null,null,null,null,null,null,"2015-12-26",null,{"$f":"IF(OR(AND(d>V_1 A_1,d<V_1 A_2),AND(d>V_2 A_1,d<V_2 A_2),AND(d>V_3 A_1,d<V_3 A_2),AND(d>V_4 A_1,d<V_4 A_2),AND(d>V_5 A_1,d<V_5 A_2),AND(d>V_6 A_1,d<V_6 A_2)),d,0)","v":42364},{"$f":"IF(OR(AND(d>V_1 B_1,d<V_1 B_2),AND(d>V_2 B_1,d<V_2 B_2),AND(d>V_3 B_1,d<V_3 B_2),AND(d>V_4 B_1,d<V_4 B_2),AND(d>V_5 B_1,d<V_5 B_2),AND(d>V_6 B_1,d<V_6 B_2)),d,0)","v":42364},{"$f":"IF(OR(AND(d>V_1 C_1,d<V_1 C_2),AND(d>V_2 C_1,d<V_2 C_2),AND(d>V_3 C_1,d<V_3 C_2),AND(d>V_4 C_1,d<V_4 C_2),AND(d>V_5 C_1,d<V_5 C_2),AND(d>V_6 C_1,d<V_6 C_2)),d,0)","v":42364},42364,42364]
[null,null,null,null,null,null,null,null,"2015-12-27",null,{"$f":"IF(OR(AND(d>V_1 A_1,d<V_1 A_2),AND(d>V_2 A_1,d<V_2 A_2),AND(d>V_3 A_1,d<V_3 A_2),AND(d>V_4 A_1,d<V_4 A_2),AND(d>V_5 A_1,d<V_5 A_2),AND(d>V_6 A_1,d<V_6 A_2)),d,0)","v":42365},{"$f":"IF(OR(AND(d>V_1 B_1,d<V_1 B_2),AND(d>V_2 B_1,d<V_2 B_2),AND(d>V_3 B_1,d<V_3 B_2),AND(d>V_4 B_1,d<V_4 B_2),AND(d>V_5 B_1,d<V_5 B_2),AND(d>V_6 B_1,d<V_6 B_2)),d,0)","v":42365},{"$f":"IF(OR(AND(d>V_1 C_1,d<V_1 C_2),AND(d>V_2 C_1,d<V_2 C_2),AND(d>V_3 C_1,d<V_3 C_2),AND(d>V_4 C_1,d<V_4 C_2),AND(d>V_5 C_1,d<V_5 C_2),AND(d>V_6 C_1,d<V_6 C_2)),d,0)","v":42365},42365,42365]
[null,null,null,null,null,null,null,null,"2015-12-28",null,{"$f":"IF(OR(AND(d>V_1 A_1,d<V_1 A_2),AND(d>V_2 A_1,d<V_2 A_2),AND(d>V_3 A_1,d<V_3 A_2),AND(d>V_4 A_1,d<V_4 A_2),AND(d>V_5 A_1,d<V_5 A_2),AND(d>V_6 A_1,d<V_6 A_2)),d,0)","v":42366},{"$f":"IF(OR(AND(d>V_1 B_1,d<V_1 B_2),AND(d>V_2 B_1,d<V_2 B_2),AND(d>V_3 B_1,d<V_3 B_2),AND(d>V_4 B_1,d<V_4 B_2),AND(d>V_5 B_1,d<V_5 B_2),AND(d>V_6 B_1,d<V_6 B_2)),d,0)","v":42366},{"$f":"IF(OR(AND(d>V_1 C_1,d<V_1 C_2),AND(d>V_2 C_1,d<V_2 C_2),AND(d>V_3 C_1,d<V_3 C_2),AND(d>V_4 C_1,d<V_4 C_2),AND(d>V_5 C_1,d<V_5 C_2),AND(d>V_6 C_1,d<V_6 C_2)),d,0)","v":42366},42366,42366]
[null,null,null,null,null,null,null,null,"2015-12-29",null,{"$f":"IF(OR(AND(d>V_1 A_1,d<V_1 A_2),AND(d>V_2 A_1,d<V_2 A_2),AND(d>V_3 A_1,d<V_3 A_2),AND(d>V_4 A_1,d<V_4 A_2),AND(d>V_5 A_1,d<V_5 A_2),AND(d>V_6 A_1,d<V_6 A_2)),d,0)","v":42367},{"$f":"IF(OR(AND(d>V_1 B_1,d<V_1 B_2),AND(d>V_2 B_1,d<V_2 B_2),AND(d>V_3 B_1,d<V_3 B_2),AND(d>V_4 B_1,d<V_4 B_2),AND(d>V_5 B_1,d<V_5 B_2),AND(d>V_6 B_1,d<V_6 B_2)),d,0)","v":42367},{"$f":"IF(OR(AND(d>V_1 C_1,d<V_1 C_2),AND(d>V_2 C_1,d<V_2 C_2),AND(d>V_3 C_1,d<V_3 C_2),AND(d>V_4 C_1,d<V_4 C_2),AND(d>V_5 C_1,d<V_5 C_2),AND(d>V_6 C_1,d<V_6 C_2)),d,0)","v":42367},42367,42367]
[null,null,null,null,null,null,null,null,"2015-12-30",null,{"$f":"IF(OR(AND(d>V_1 A_1,d<V_1 A_2),AND(d>V_2 A_1,d<V_2 A_2),AND(d>V_3 A_1,d<V_3 A_2),AND(d>V_4 A_1,d<V_4 A_2),AND(d>V_5 A_1,d<V_5 A_2),AND(d>V_6 A_1,d<V_6 A_2)),d,0)","v":42368},{"$f":"IF(OR(AND(d>V_1 B_1,d<V_1 B_2),AND(d>V_2 B_1,d<V_2 B_2),AND(d>V_3 B_1,d<V_3 B_2),AND(d>V_4 B_1,d<V_4 B_2),AND(d>V_5 B_1,d<V_5 B_2),AND(d>V_6 B_1,d<V_6 B_2)),d,0)","v":42368},{"$f":"IF(OR(AND(d>V_1 C_1,d<V_1 C_2),AND(d>V_2 C_1,d<V_2 C_2),AND(d>V_3 C_1,d<V_3 C_2),AND(d>V_4 C_1,d<V_4 C_2),AND(d>V_5 C_1,d<V_5 C_2),AND(d>V_6 C_1,d<V_6 C_2)),d,0)","v":42368},42368,42368]
[null,null,null,null,null,null,null,null,"2015-12-31",null,{"$f":"IF(OR(AND(d>V_1 A_1,d<V_1 A_2),AND(d>V_2 A_1,d<V_2 A_2),AND(d>V_3 A_1,d<V_3 A_2),AND(d>V_4 A_1,d<V_4 A_2),AND(d>V_5 A_1,d<V_5 A_2),AND(d>V_6 A_1,d<V_6 A_2)),d,0)","v":42369},{"$f":"IF(OR(AND(d>V_1 B_1,d<V_1 B_2),AND(d>V_2 B_1,d<V_2 B_2),AND(d>V_3 B_1,d<V_3 B_2),AND(d>V_4 B_1,d<V_4 B_2),AND(d>V_5 B_1,d<V_5 B_2),AND(d>V_6 B_1,d<V_6 B_2)),d,0)","v":42369},{"$f":"IF(OR(AND(d>V_1 C_1,d<V_1 C_2),AND(d>V_2 C_1,d<V_2 C_2),AND(d>V_3 C_1,d<V_3 C_2),AND(d>V_4 C_1,d<V_4 C_2),AND(d>V_5 C_1,d<V_5 C_2),AND(d>V_6 C_1,d<V_6 C_2)),d,0)","v":42369},42369,42369]
[null,null,null,null,null,null,null,null,"2016-01-01",null,{"$f":"IF(OR(AND(d>V_1 A_1,d<V_1 A_2),AND(d>V_2 A_1,d<V_2 A_2),AND(d>V_3 A_1,d<V_3 A_2),AND(d>V_4 A_1,d<V_4 A_2),AND(d>V_5 A_1,d<V_5 A_2),AND(d>V_6 A_1,d<V_6 A_2)),d,0)","v":42370},{"$f":"IF(OR(AND(d>V_1 B_1,d<V_1 B_2),AND(d>V_2 B_1,d<V_2 B_2),AND(d>V_3 B_1,d<V_3 B_2),AND(d>V_4 B_1,d<V_4 B_2),AND(d>V_5 B_1,d<V_5 B_2),AND(d>V_6 B_1,d<V_6 B_2)),d,0)","v":42370},{"$f":"IF(OR(AND(d>V_1 C_1,d<V_1 C_2),AND(d>V_2 C_1,d<V_2 C_2),AND(d>V_3 C_1,d<V_3 C_2),AND(d>V_4 C_1,d<V_4 C_2),AND(d>V_5 C_1,d<V_5 C_2),AND(d>V_6 C_1,d<V_6 C_2)),d,0)","v":42370},42370,42370]
[null,null,null,null,null,null,null,null,"2016-01-02",null,{"$f":"IF(OR(AND(d>V_1 A_1,d<V_1 A_2),AND(d>V_2 A_1,d<V_2 A_2),AND(d>V_3 A_1,d<V_3 A_2),AND(d>V_4 A_1,d<V_4 A_2),AND(d>V_5 A_1,d<V_5 A_2),AND(d>V_6 A_1,d<V_6 A_2)),d,0)","v":42371},{"$f":"IF(OR(AND(d>V_1 B_1,d<V_1 B_2),AND(d>V_2 B_1,d<V_2 B_2),AND(d>V_3 B_1,d<V_3 B_2),AND(d>V_4 B_1,d<V_4 B_2),AND(d>V_5 B_1,d<V_5 B_2),AND(d>V_6 B_1,d<V_6 B_2)),d,0)","v":42371},{"$f":"IF(OR(AND(d>V_1 C_1,d<V_1 C_2),AND(d>V_2 C_1,d<V_2 C_2),AND(d>V_3 C_1,d<V_3 C_2),AND(d>V_4 C_1,d<V_4 C_2),AND(d>V_5 C_1,d<V_5 C_2),AND(d>V_6 C_1,d<V_6 C_2)),d,0)","v":42371},42371,42371]
[null,null,null,null,null,null,null,null,"2016-01-03",null,{"$f":"IF(OR(AND(d>V_1 A_1,d<V_1 A_2),AND(d>V_2 A_1,d<V_2 A_2),AND(d>V_3 A_1,d<V_3 A_2),AND(d>V_4 A_1,d<V_4 A_2),AND(d>V_5 A_1,d<V_5 A_2),AND(d>V_6 A_1,d<V_6 A_2)),d,0)","v":42372},{"$f":"IF(OR(AND(d>V_1 B_1,d<V_1 B_2),AND(d>V_2 B_1,d<V_2 B_2),AND(d>V_3 B_1,d<V_3 B_2),AND(d>V_4 B_1,d<V_4 B_2),AND(d>V_5 B_1,d<V_5 B_2),AND(d>V_6 B_1,d<V_6 B_2)),d,0)","v":42372},{"$f":"IF(OR(AND(d>V_1 C_1,d<V_1 C_2),AND(d>V_2 C_1,d<V_2 C_2),AND(d>V_3 C_1,d<V_3 C_2),AND(d>V_4 C_1,d<V_4 C_2),AND(d>V_5 C_1,d<V_5 C_2),AND(d>V_6 C_1,d<V_6 C_2)),d,0)","v":42372},42372,42372]
[null,null,null,null,null,null,null,null,"2016-01-04",null,{"$f":"IF(OR(AND(d>V_1 A_1,d<V_1 A_2),AND(d>V_2 A_1,d<V_2 A_2),AND(d>V_3 A_1,d<V_3 A_2),AND(d>V_4 A_1,d<V_4 A_2),AND(d>V_5 A_1,d<V_5 A_2),AND(d>V_6 A_1,d<V_6 A_2)),d,0)","v":0},{"$f":"IF(OR(AND(d>V_1 B_1,d<V_1 B_2),AND(d>V_2 B_1,d<V_2 B_2),AND(d>V_3 B_1,d<V_3 B_2),AND(d>V_4 B_1,d<V_4 B_2),AND(d>V_5 B_1,d<V_5 B_2),AND(d>V_6 B_1,d<V_6 B_2)),d,0)","v":0},{"$f":"IF(OR(AND(d>V_1 C_1,d<V_1 C_2),AND(d>V_2 C_1,d<V_2 C_2),AND(d>V_3 C_1,d<V_3 C_2),AND(d>V_4 C_1,d<V_4 C_2),AND(d>V_5 C_1,d<V_5 C_2),AND(d>V_6 C_1,d<V_6 C_2)),d,0)","v":0},0,0]
[null,null,null,null,null,null,null,null,"2016-01-05",null,{"$f":"IF(OR(AND(d>V_1 A_1,d<V_1 A_2),AND(d>V_2 A_1,d<V_2 A_2),AND(d>V_3 A_1,d<V_3 A_2),AND(d>V_4 A_1,d<V_4 A_2),AND(d>V_5 A_1,d<V_5 A_2),AND(d>V_6 A_1,d<V_6 A_2)),d,0)","v":0},{"$f":"IF(OR(AND(d>V_1 B_1,d<V_1 B_2),AND(d>V_2 B_1,d<V_2 B_2),AND(d>V_3 B_1,d<V_3 B_2),AND(d>V_4 B_1,d<V_4 B_2),AND(d>V_5 B_1,d<V_5 B_2),AND(d>V_6 B_1,d<V_6 B_2)),d,0)","v":0},{"$f":"IF(OR(AND(d>V_1 C_1,d<V_1 C_2),AND(d>V_2 C_1,d<V_2 C_2),AND(d>V_3 C_1,d<V_3 C_2),AND(d>V_4 C_1,d<V_4 C_2),AND(d>V_5 C_1,d<V_5 C_2),AND(d>V_6 C_1,d<V_6 C_2)),d,0)","v":0},0,0]
[null,null,null,null,null,null,null,null,"2016-01-06",null,{"$f":"IF(OR(AND(d>V_1 A_1,d<V_1 A_2),AND(d>V_2 A_1,d<V_2 A_2),AND(d>V_3 A_1,d<V_3 A_2),AND(d>V_4 A_1,d<V_4 A_2),AND(d>V_5 A_1,d<V_5 A_2),AND(d>V_6 A_1,d<V_6 A_2)),d,0)","v":0},{"$f":"IF(OR(AND(d>V_1 B_1,d<V_1 B_2),AND(d>V_2 B_1,d<V_2 B_2),AND(d>V_3 B_1,d<V_3 B_2),AND(d>V_4 B_1,d<V_4 B_2),AND(d>V_5 B_1,d<V_5 B_2),AND(d>V_6 B_1,d<V_6 B_2)),d,0)","v":0},{"$f":"IF(OR(AND(d>V_1 C_1,d<V_1 C_2),AND(d>V_2 C_1,d<V_2 C_2),AND(d>V_3 C_1,d<V_3 C_2),AND(d>V_4 C_1,d<V_4 C_2),AND(d>V_5 C_1,d<V_5 C_2),AND(d>V_6 C_1,d<V_6 C_2)),d,0)","v":0},0,0]
[null,null,null,null,null,null,null,null,"2016-01-07",null,{"$f":"IF(OR(AND(d>V_1 A_1,d<V_1 A_2),AND(d>V_2 A_1,d<V_2 A_2),AND(d>V_3 A_1,d<V_3 A_2),AND(d>V_4 A_1,d<V_4 A_2),AND(d>V_5 A_1,d<V_5 A_2),AND(d>V_6 A_1,d<V_6 A_2)),d,0)","v":0},{"$f":"IF(OR(AND(d>V_1 B_1,d<V_1 B_2),AND(d>V_2 B_1,d<V_2 B_2),AND(d>V_3 B_1,d<V_3 B_2),AND(d>V_4 B_1,d<V_4 B_2),AND(d>V_5 B_1,d<V_5 B_2),AND(d>V_6 B_1,d<V_6 B_2)),d,0)","v":0},{"$f":"IF(OR(AND(d>V_1 C_1,d<V_1 C_2),AND(d>V_2 C_1,d<V_2 C_2),AND(d>V_3 C_1,d<V_3 C_2),AND(d>V_4 C_1,d<V_4 C_2),AND(d>V_5 C_1,d<V_5 C_2),AND(d>V_6 C_1,d<V_6 C_2)),d,0)","v":0},0,0]
[null,null,null,null,null,null,null,null,"2016-01-08",null,{"$f":"IF(OR(AND(d>V_1 A_1,d<V_1 A_2),AND(d>V_2 A_1,d<V_2 A_2),AND(d>V_3 A_1,d<V_3 A_2),AND(d>V_4 A_1,d<V_4 A_2),AND(d>V_5 A_1,d<V_5 A_2),AND(d>V_6 A_1,d<V_6 A_2)),d,0)","v":0},{"$f":"IF(OR(AND(d>V_1 B_1,d<V_1 B_2),AND(d>V_2 B_1,d<V_2 B_2),AND(d>V_3 B_1,d<V_3 B_2),AND(d>V_4 B_1,d<V_4 B_2),AND(d>V_5 B_1,d<V_5 B_2),AND(d>V_6 B_1,d<V_6 B_2)),d,0)","v":0},{"$f":"IF(OR(AND(d>V_1 C_1,d<V_1 C_2),AND(d>V_2 C_1,d<V_2 C_2),AND(d>V_3 C_1,d<V_3 C_2),AND(d>V_4 C_1,d<V_4 C_2),AND(d>V_5 C_1,d<V_5 C_2),AND(d>V_6 C_1,d<V_6 C_2)),d,0)","v":0},0,0]
[null,null,null,null,null,null,null,null,"2016-01-09",null,{"$f":"IF(OR(AND(d>V_1 A_1,d<V_1 A_2),AND(d>V_2 A_1,d<V_2 A_2),AND(d>V_3 A_1,d<V_3 A_2),AND(d>V_4 A_1,d<V_4 A_2),AND(d>V_5 A_1,d<V_5 A_2),AND(d>V_6 A_1,d<V_6 A_2)),d,0)","v":0},{"$f":"IF(OR(AND(d>V_1 B_1,d<V_1 B_2),AND(d>V_2 B_1,d<V_2 B_2),AND(d>V_3 B_1,d<V_3 B_2),AND(d>V_4 B_1,d<V_4 B_2),AND(d>V_5 B_1,d<V_5 B_2),AND(d>V_6 B_1,d<V_6 B_2)),d,0)","v":0},{"$f":"IF(OR(AND(d>V_1 C_1,d<V_1 C_2),AND(d>V_2 C_1,d<V_2 C_2),AND(d>V_3 C_1,d<V_3 C_2),AND(d>V_4 C_1,d<V_4 C_2),AND(d>V_5 C_1,d<V_5 C_2),AND(d>V_6 C_1,d<V_6 C_2)),d,0)","v":0},0,0]
[null,null,null,null,null,null,null,null,"2016-01-10",null,{"$f":"IF(OR(AND(d>V_1 A_1,d<V_1 A_2),AND(d>V_2 A_1,d<V_2 A_2),AND(d>V_3 A_1,d<V_3 A_2),AND(d>V_4 A_1,d<V_4 A_2),AND(d>V_5 A_1,d<V_5 A_2),AND(d>V_6 A_1,d<V_6 A_2)),d,0)","v":0},{"$f":"IF(OR(AND(d>V_1 B_1,d<V_1 B_2),AND(d>V_2 B_1,d<V_2 B_2),AND(d>V_3 B_1,d<V_3 B_2),AND(d>V_4 B_1,d<V_4 B_2),AND(d>V_5 B_1,d<V_5 B_2),AND(d>V_6 B_1,d<V_6 B_2)),d,0)","v":0},{"$f":"IF(OR(AND(d>V_1 C_1,d<V_1 C_2),AND(d>V_2 C_1,d<V_2 C_2),AND(d>V_3 C_1,d<V_3 C_2),AND(d>V_4 C_1,d<V_4 C_2),AND(d>V_5 C_1,d<V_5 C_2),AND(d>V_6 C_1,d<V_6 C_2)),d,0)","v":0},0,0]
[null,null,null,null,null,null,null,null,"2016-01-11",null,{"$f":"IF(OR(AND(d>V_1 A_1,d<V_1 A_2),AND(d>V_2 A_1,d<V_2 A_2),AND(d>V_3 A_1,d<V_3 A_2),AND(d>V_4 A_1,d<V_4 A_2),AND(d>V_5 A_1,d<V_5 A_2),AND(d>V_6 A_1,d<V_6 A_2)),d,0)","v":0},{"$f":"IF(OR(AND(d>V_1 B_1,d<V_1 B_2),AND(d>V_2 B_1,d<V_2 B_2),AND(d>V_3 B_1,d<V_3 B_2),AND(d>V_4 B_1,d<V_4 B_2),AND(d>V_5 B_1,d<V_5 B_2),AND(d>V_6 B_1,d<V_6 B_2)),d,0)","v":0},{"$f":"IF(OR(AND(d>V_1 C_1,d<V_1 C_2),AND(d>V_2 C_1,d<V_2 C_2),AND(d>V_3 C_1,d<V_3 C_2),AND(d>V_4 C_1,d<V_4 C_2),AND(d>V_5 C_1,d<V_5 C_2),AND(d>V_6 C_1,d<V_6 C_2)),d,0)","v":0},0,0]
[null,null,null,null,null,null,null,null,"2016-01-12",null,{"$f":"IF(OR(AND(d>V_1 A_1,d<V_1 A_2),AND(d>V_2 A_1,d<V_2 A_2),AND(d>V_3 A_1,d<V_3 A_2),AND(d>V_4 A_1,d<V_4 A_2),AND(d>V_5 A_1,d<V_5 A_2),AND(d>V_6 A_1,d<V_6 A_2)),d,0)","v":0},{"$f":"IF(OR(AND(d>V_1 B_1,d<V_1 B_2),AND(d>V_2 B_1,d<V_2 B_2),AND(d>V_3 B_1,d<V_3 B_2),AND(d>V_4 B_1,d<V_4 B_2),AND(d>V_5 B_1,d<V_5 B_2),AND(d>V_6 B_1,d<V_6 B_2)),d,0)","v":0},{"$f":"IF(OR(AND(d>V_1 C_1,d<V_1 C_2),AND(d>V_2 C_1,d<V_2 C_2),AND(d>V_3 C_1,d<V_3 C_2),AND(d>V_4 C_1,d<V_4 C_2),AND(d>V_5 C_1,d<V_5 C_2),AND(d>V_6 C_1,d<V_6 C_2)),d,0)","v":0},0,{"$f":"INDEX(J202:N202,choix_zone)","v":0}]
[null,null,null,null,null,null,null,null,"2016-01-13",null,{"$f":"IF(OR(AND(d>V_1 A_1,d<V_1 A_2),AND(d>V_2 A_1,d<V_2 A_2),AND(d>V_3 A_1,d<V_3 A_2),AND(d>V_4 A_1,d<V_4 A_2),AND(d>V_5 A_1,d<V_5 A_2),AND(d>V_6 A_1,d<V_6 A_2)),d,0)","v":0},{"$f":"IF(OR(AND(d>V_1 B_1,d<V_1 B_2),AND(d>V_2 B_1,d<V_2 B_2),AND(d>V_3 B_1,d<V_3 B_2),AND(d>V_4 B_1,d<V_4 B_2),AND(d>V_5 B_1,d<V_5 B_2),AND(d>V_6 B_1,d<V_6 B_2)),d,0)","v":0},{"$f":"IF(OR(AND(d>V_1 C_1,d<V_1 C_2),AND(d>V_2 C_1,d<V_2 C_2),AND(d>V_3 C_1,d<V_3 C_2),AND(d>V_4 C_1,d<V_4 C_2),AND(d>V_5 C_1,d<V_5 C_2),AND(d>V_6 C_1,d<V_6 C_2)),d,0)","v":0},{"$f":"MAX(K203:M203)","v":0},0]
[null,null,null,null,null,null,null,null,{"$f":"I203+1","v":"2016-01-14"},null,{"$f":"IF(OR(AND(d>V_1 A_1,d<V_1 A_2),AND(d>V_2 A_1,d<V_2 A_2),AND(d>V_3 A_1,d<V_3 A_2),AND(d>V_4 A_1,d<V_4 A_2),AND(d>V_5 A_1,d<V_5 A_2),AND(d>V_6 A_1,d<V_6 A_2)),d,0)","v":0},{"$f":"IF(OR(AND(d>V_1 B_1,d<V_1 B_2),AND(d>V_2 B_1,d<V_2 B_2),AND(d>V_3 B_1,d<V_3 B_2),AND(d>V_4 B_1,d<V_4 B_2),AND(d>V_5 B_1,d<V_5 B_2),AND(d>V_6 B_1,d<V_6 B_2)),d,0)","v":0},{"$f":"IF(OR(AND(d>V_1 C_1,d<V_1 C_2),AND(d>V_2 C_1,d<V_2 C_2),AND(d>V_3 C_1,d<V_3 C_2),AND(d>V_4 C_1,d<V_4 C_2),AND(d>V_5 C_1,d<V_5 C_2),AND(d>V_6 C_1,d<V_6 C_2)),d,0)","v":0},0,0]
[null,null,null,null,null,null,null,null,"2016-01-15",null,{"$f":"IF(OR(AND(d>V_1 A_1,d<V_1 A_2),AND(d>V_2 A_1,d<V_2 A_2),AND(d>V_3 A_1,d<V_3 A_2),AND(d>V_4 A_1,d<V_4 A_2),AND(d>V_5 A_1,d<V_5 A_2),AND(d>V_6 A_1,d<V_6 A_2)),d,0)","v":0},{"$f":"IF(OR(AND(d>V_1 B_1,d<V_1 B_2),AND(d>V_2 B_1,d<V_2 B_2),AND(d>V_3 B_1,d<V_3 B_2),AND(d>V_4 B_1,d<V_4 B_2),AND(d>V_5 B_1,d<V_5 B_2),AND(d>V_6 B_1,d<V_6 B_2)),d,0)","v":0},{"$f":"IF(OR(AND(d>V_1 C_1,d<V_1 C_2),AND(d>V_2 C_1,d<V_2 C_2),AND(d>V_3 C_1,d<V_3 C_2),AND(d>V_4 C_1,d<V_4 C_2),AND(d>V_5 C_1,d<V_5 C_2),AND(d>V_6 C_1,d<V_6 C_2)),d,0)","v":0},0,0]
[null,null,null,null,null,null,null,null,"2016-01-16",null,{"$f":"IF(OR(AND(d>V_1 A_1,d<V_1 A_2),AND(d>V_2 A_1,d<V_2 A_2),AND(d>V_3 A_1,d<V_3 A_2),AND(d>V_4 A_1,d<V_4 A_2),AND(d>V_5 A_1,d<V_5 A_2),AND(d>V_6 A_1,d<V_6 A_2)),d,0)","v":0},{"$f":"IF(OR(AND(d>V_1 B_1,d<V_1 B_2),AND(d>V_2 B_1,d<V_2 B_2),AND(d>V_3 B_1,d<V_3 B_2),AND(d>V_4 B_1,d<V_4 B_2),AND(d>V_5 B_1,d<V_5 B_2),AND(d>V_6 B_1,d<V_6 B_2)),d,0)","v":0},{"$f":"IF(OR(AND(d>V_1 C_1,d<V_1 C_2),AND(d>V_2 C_1,d<V_2 C_2),AND(d>V_3 C_1,d<V_3 C_2),AND(d>V_4 C_1,d<V_4 C_2),AND(d>V_5 C_1,d<V_5 C_2),AND(d>V_6 C_1,d<V_6 C_2)),d,0)","v":0},0,0]
[null,null,null,null,null,null,null,null,"2016-01-17",null,{"$f":"IF(OR(AND(d>V_1 A_1,d<V_1 A_2),AND(d>V_2 A_1,d<V_2 A_2),AND(d>V_3 A_1,d<V_3 A_2),AND(d>V_4 A_1,d<V_4 A_2),AND(d>V_5 A_1,d<V_5 A_2),AND(d>V_6 A_1,d<V_6 A_2)),d,0)","v":0},{"$f":"IF(OR(AND(d>V_1 B_1,d<V_1 B_2),AND(d>V_2 B_1,d<V_2 B_2),AND(d>V_3 B_1,d<V_3 B_2),AND(d>V_4 B_1,d<V_4 B_2),AND(d>V_5 B_1,d<V_5 B_2),AND(d>V_6 B_1,d<V_6 B_2)),d,0)","v":0},{"$f":"IF(OR(AND(d>V_1 C_1,d<V_1 C_2),AND(d>V_2 C_1,d<V_2 C_2),AND(d>V_3 C_1,d<V_3 C_2),AND(d>V_4 C_1,d<V_4 C_2),AND(d>V_5 C_1,d<V_5 C_2),AND(d>V_6 C_1,d<V_6 C_2)),d,0)","v":0},0,0]
[null,null,null,null,null,null,null,null,"2016-01-18",null,{"$f":"IF(OR(AND(d>V_1 A_1,d<V_1 A_2),AND(d>V_2 A_1,d<V_2 A_2),AND(d>V_3 A_1,d<V_3 A_2),AND(d>V_4 A_1,d<V_4 A_2),AND(d>V_5 A_1,d<V_5 A_2),AND(d>V_6 A_1,d<V_6 A_2)),d,0)","v":0},{"$f":"IF(OR(AND(d>V_1 B_1,d<V_1 B_2),AND(d>V_2 B_1,d<V_2 B_2),AND(d>V_3 B_1,d<V_3 B_2),AND(d>V_4 B_1,d<V_4 B_2),AND(d>V_5 B_1,d<V_5 B_2),AND(d>V_6 B_1,d<V_6 B_2)),d,0)","v":0},{"$f":"IF(OR(AND(d>V_1 C_1,d<V_1 C_2),AND(d>V_2 C_1,d<V_2 C_2),AND(d>V_3 C_1,d<V_3 C_2),AND(d>V_4 C_1,d<V_4 C_2),AND(d>V_5 C_1,d<V_5 C_2),AND(d>V_6 C_1,d<V_6 C_2)),d,0)","v":0},0,0]
[null,null,null,null,null,null,null,null,"2016-01-19",null,{"$f":"IF(OR(AND(d>V_1 A_1,d<V_1 A_2),AND(d>V_2 A_1,d<V_2 A_2),AND(d>V_3 A_1,d<V_3 A_2),AND(d>V_4 A_1,d<V_4 A_2),AND(d>V_5 A_1,d<V_5 A_2),AND(d>V_6 A_1,d<V_6 A_2)),d,0)","v":0},{"$f":"IF(OR(AND(d>V_1 B_1,d<V_1 B_2),AND(d>V_2 B_1,d<V_2 B_2),AND(d>V_3 B_1,d<V_3 B_2),AND(d>V_4 B_1,d<V_4 B_2),AND(d>V_5 B_1,d<V_5 B_2),AND(d>V_6 B_1,d<V_6 B_2)),d,0)","v":0},{"$f":"IF(OR(AND(d>V_1 C_1,d<V_1 C_2),AND(d>V_2 C_1,d<V_2 C_2),AND(d>V_3 C_1,d<V_3 C_2),AND(d>V_4 C_1,d<V_4 C_2),AND(d>V_5 C_1,d<V_5 C_2),AND(d>V_6 C_1,d<V_6 C_2)),d,0)","v":0},0,0]
[null,null,null,null,null,null,null,null,"2016-01-20",null,{"$f":"IF(OR(AND(d>V_1 A_1,d<V_1 A_2),AND(d>V_2 A_1,d<V_2 A_2),AND(d>V_3 A_1,d<V_3 A_2),AND(d>V_4 A_1,d<V_4 A_2),AND(d>V_5 A_1,d<V_5 A_2),AND(d>V_6 A_1,d<V_6 A_2)),d,0)","v":0},{"$f":"IF(OR(AND(d>V_1 B_1,d<V_1 B_2),AND(d>V_2 B_1,d<V_2 B_2),AND(d>V_3 B_1,d<V_3 B_2),AND(d>V_4 B_1,d<V_4 B_2),AND(d>V_5 B_1,d<V_5 B_2),AND(d>V_6 B_1,d<V_6 B_2)),d,0)","v":0},{"$f":"IF(OR(AND(d>V_1 C_1,d<V_1 C_2),AND(d>V_2 C_1,d<V_2 C_2),AND(d>V_3 C_1,d<V_3 C_2),AND(d>V_4 C_1,d<V_4 C_2),AND(d>V_5 C_1,d<V_5 C_2),AND(d>V_6 C_1,d<V_6 C_2)),d,0)","v":0},0,0]
[null,null,null,null,null,null,null,null,"2016-01-21",null,{"$f":"IF(OR(AND(d>V_1 A_1,d<V_1 A_2),AND(d>V_2 A_1,d<V_2 A_2),AND(d>V_3 A_1,d<V_3 A_2),AND(d>V_4 A_1,d<V_4 A_2),AND(d>V_5 A_1,d<V_5 A_2),AND(d>V_6 A_1,d<V_6 A_2)),d,0)","v":0},{"$f":"IF(OR(AND(d>V_1 B_1,d<V_1 B_2),AND(d>V_2 B_1,d<V_2 B_2),AND(d>V_3 B_1,d<V_3 B_2),AND(d>V_4 B_1,d<V_4 B_2),AND(d>V_5 B_1,d<V_5 B_2),AND(d>V_6 B_1,d<V_6 B_2)),d,0)","v":0},{"$f":"IF(OR(AND(d>V_1 C_1,d<V_1 C_2),AND(d>V_2 C_1,d<V_2 C_2),AND(d>V_3 C_1,d<V_3 C_2),AND(d>V_4 C_1,d<V_4 C_2),AND(d>V_5 C_1,d<V_5 C_2),AND(d>V_6 C_1,d<V_6 C_2)),d,0)","v":0},0,0]
[null,null,null,null,null,null,null,null,"2016-01-22",null,{"$f":"IF(OR(AND(d>V_1 A_1,d<V_1 A_2),AND(d>V_2 A_1,d<V_2 A_2),AND(d>V_3 A_1,d<V_3 A_2),AND(d>V_4 A_1,d<V_4 A_2),AND(d>V_5 A_1,d<V_5 A_2),AND(d>V_6 A_1,d<V_6 A_2)),d,0)","v":0},{"$f":"IF(OR(AND(d>V_1 B_1,d<V_1 B_2),AND(d>V_2 B_1,d<V_2 B_2),AND(d>V_3 B_1,d<V_3 B_2),AND(d>V_4 B_1,d<V_4 B_2),AND(d>V_5 B_1,d<V_5 B_2),AND(d>V_6 B_1,d<V_6 B_2)),d,0)","v":0},{"$f":"IF(OR(AND(d>V_1 C_1,d<V_1 C_2),AND(d>V_2 C_1,d<V_2 C_2),AND(d>V_3 C_1,d<V_3 C_2),AND(d>V_4 C_1,d<V_4 C_2),AND(d>V_5 C_1,d<V_5 C_2),AND(d>V_6 C_1,d<V_6 C_2)),d,0)","v":0},0,0]
[null,null,null,null,null,null,null,null,"2016-01-23",null,{"$f":"IF(OR(AND(d>V_1 A_1,d<V_1 A_2),AND(d>V_2 A_1,d<V_2 A_2),AND(d>V_3 A_1,d<V_3 A_2),AND(d>V_4 A_1,d<V_4 A_2),AND(d>V_5 A_1,d<V_5 A_2),AND(d>V_6 A_1,d<V_6 A_2)),d,0)","v":0},{"$f":"IF(OR(AND(d>V_1 B_1,d<V_1 B_2),AND(d>V_2 B_1,d<V_2 B_2),AND(d>V_3 B_1,d<V_3 B_2),AND(d>V_4 B_1,d<V_4 B_2),AND(d>V_5 B_1,d<V_5 B_2),AND(d>V_6 B_1,d<V_6 B_2)),d,0)","v":0},{"$f":"IF(OR(AND(d>V_1 C_1,d<V_1 C_2),AND(d>V_2 C_1,d<V_2 C_2),AND(d>V_3 C_1,d<V_3 C_2),AND(d>V_4 C_1,d<V_4 C_2),AND(d>V_5 C_1,d<V_5 C_2),AND(d>V_6 C_1,d<V_6 C_2)),d,0)","v":0},0,0]
[null,null,null,null,null,null,null,null,"2016-01-24",null,{"$f":"IF(OR(AND(d>V_1 A_1,d<V_1 A_2),AND(d>V_2 A_1,d<V_2 A_2),AND(d>V_3 A_1,d<V_3 A_2),AND(d>V_4 A_1,d<V_4 A_2),AND(d>V_5 A_1,d<V_5 A_2),AND(d>V_6 A_1,d<V_6 A_2)),d,0)","v":0},{"$f":"IF(OR(AND(d>V_1 B_1,d<V_1 B_2),AND(d>V_2 B_1,d<V_2 B_2),AND(d>V_3 B_1,d<V_3 B_2),AND(d>V_4 B_1,d<V_4 B_2),AND(d>V_5 B_1,d<V_5 B_2),AND(d>V_6 B_1,d<V_6 B_2)),d,0)","v":0},{"$f":"IF(OR(AND(d>V_1 C_1,d<V_1 C_2),AND(d>V_2 C_1,d<V_2 C_2),AND(d>V_3 C_1,d<V_3 C_2),AND(d>V_4 C_1,d<V_4 C_2),AND(d>V_5 C_1,d<V_5 C_2),AND(d>V_6 C_1,d<V_6 C_2)),d,0)","v":0},0,0]
[null,null,null,null,null,null,null,null,"2016-01-25",null,{"$f":"IF(OR(AND(d>V_1 A_1,d<V_1 A_2),AND(d>V_2 A_1,d<V_2 A_2),AND(d>V_3 A_1,d<V_3 A_2),AND(d>V_4 A_1,d<V_4 A_2),AND(d>V_5 A_1,d<V_5 A_2),AND(d>V_6 A_1,d<V_6 A_2)),d,0)","v":0},{"$f":"IF(OR(AND(d>V_1 B_1,d<V_1 B_2),AND(d>V_2 B_1,d<V_2 B_2),AND(d>V_3 B_1,d<V_3 B_2),AND(d>V_4 B_1,d<V_4 B_2),AND(d>V_5 B_1,d<V_5 B_2),AND(d>V_6 B_1,d<V_6 B_2)),d,0)","v":0},{"$f":"IF(OR(AND(d>V_1 C_1,d<V_1 C_2),AND(d>V_2 C_1,d<V_2 C_2),AND(d>V_3 C_1,d<V_3 C_2),AND(d>V_4 C_1,d<V_4 C_2),AND(d>V_5 C_1,d<V_5 C_2),AND(d>V_6 C_1,d<V_6 C_2)),d,0)","v":0},0,0]
[null,null,null,null,null,null,null,null,"2016-01-26",null,{"$f":"IF(OR(AND(d>V_1 A_1,d<V_1 A_2),AND(d>V_2 A_1,d<V_2 A_2),AND(d>V_3 A_1,d<V_3 A_2),AND(d>V_4 A_1,d<V_4 A_2),AND(d>V_5 A_1,d<V_5 A_2),AND(d>V_6 A_1,d<V_6 A_2)),d,0)","v":0},{"$f":"IF(OR(AND(d>V_1 B_1,d<V_1 B_2),AND(d>V_2 B_1,d<V_2 B_2),AND(d>V_3 B_1,d<V_3 B_2),AND(d>V_4 B_1,d<V_4 B_2),AND(d>V_5 B_1,d<V_5 B_2),AND(d>V_6 B_1,d<V_6 B_2)),d,0)","v":0},{"$f":"IF(OR(AND(d>V_1 C_1,d<V_1 C_2),AND(d>V_2 C_1,d<V_2 C_2),AND(d>V_3 C_1,d<V_3 C_2),AND(d>V_4 C_1,d<V_4 C_2),AND(d>V_5 C_1,d<V_5 C_2),AND(d>V_6 C_1,d<V_6 C_2)),d,0)","v":0},0,0]
[null,null,null,null,null,null,null,null,"2016-01-27",null,{"$f":"IF(OR(AND(d>V_1 A_1,d<V_1 A_2),AND(d>V_2 A_1,d<V_2 A_2),AND(d>V_3 A_1,d<V_3 A_2),AND(d>V_4 A_1,d<V_4 A_2),AND(d>V_5 A_1,d<V_5 A_2),AND(d>V_6 A_1,d<V_6 A_2)),d,0)","v":0},{"$f":"IF(OR(AND(d>V_1 B_1,d<V_1 B_2),AND(d>V_2 B_1,d<V_2 B_2),AND(d>V_3 B_1,d<V_3 B_2),AND(d>V_4 B_1,d<V_4 B_2),AND(d>V_5 B_1,d<V_5 B_2),AND(d>V_6 B_1,d<V_6 B_2)),d,0)","v":0},{"$f":"IF(OR(AND(d>V_1 C_1,d<V_1 C_2),AND(d>V_2 C_1,d<V_2 C_2),AND(d>V_3 C_1,d<V_3 C_2),AND(d>V_4 C_1,d<V_4 C_2),AND(d>V_5 C_1,d<V_5 C_2),AND(d>V_6 C_1,d<V_6 C_2)),d,0)","v":0},0,0]
[null,null,null,null,null,null,null,null,"2016-01-28",null,{"$f":"IF(OR(AND(d>V_1 A_1,d<V_1 A_2),AND(d>V_2 A_1,d<V_2 A_2),AND(d>V_3 A_1,d<V_3 A_2),AND(d>V_4 A_1,d<V_4 A_2),AND(d>V_5 A_1,d<V_5 A_2),AND(d>V_6 A_1,d<V_6 A_2)),d,0)","v":0},{"$f":"IF(OR(AND(d>V_1 B_1,d<V_1 B_2),AND(d>V_2 B_1,d<V_2 B_2),AND(d>V_3 B_1,d<V_3 B_2),AND(d>V_4 B_1,d<V_4 B_2),AND(d>V_5 B_1,d<V_5 B_2),AND(d>V_6 B_1,d<V_6 B_2)),d,0)","v":0},{"$f":"IF(OR(AND(d>V_1 C_1,d<V_1 C_2),AND(d>V_2 C_1,d<V_2 C_2),AND(d>V_3 C_1,d<V_3 C_2),AND(d>V_4 C_1,d<V_4 C_2),AND(d>V_5 C_1,d<V_5 C_2),AND(d>V_6 C_1,d<V_6 C_2)),d,0)","v":0},0,0]
[null,null,null,null,null,null,null,null,"2016-01-29",null,{"$f":"IF(OR(AND(d>V_1 A_1,d<V_1 A_2),AND(d>V_2 A_1,d<V_2 A_2),AND(d>V_3 A_1,d<V_3 A_2),AND(d>V_4 A_1,d<V_4 A_2),AND(d>V_5 A_1,d<V_5 A_2),AND(d>V_6 A_1,d<V_6 A_2)),d,0)","v":0},{"$f":"IF(OR(AND(d>V_1 B_1,d<V_1 B_2),AND(d>V_2 B_1,d<V_2 B_2),AND(d>V_3 B_1,d<V_3 B_2),AND(d>V_4 B_1,d<V_4 B_2),AND(d>V_5 B_1,d<V_5 B_2),AND(d>V_6 B_1,d<V_6 B_2)),d,0)","v":0},{"$f":"IF(OR(AND(d>V_1 C_1,d<V_1 C_2),AND(d>V_2 C_1,d<V_2 C_2),AND(d>V_3 C_1,d<V_3 C_2),AND(d>V_4 C_1,d<V_4 C_2),AND(d>V_5 C_1,d<V_5 C_2),AND(d>V_6 C_1,d<V_6 C_2)),d,0)","v":0},0,0]
[null,null,null,null,null,null,null,null,"2016-01-30",null,{"$f":"IF(OR(AND(d>V_1 A_1,d<V_1 A_2),AND(d>V_2 A_1,d<V_2 A_2),AND(d>V_3 A_1,d<V_3 A_2),AND(d>V_4 A_1,d<V_4 A_2),AND(d>V_5 A_1,d<V_5 A_2),AND(d>V_6 A_1,d<V_6 A_2)),d,0)","v":0},{"$f":"IF(OR(AND(d>V_1 B_1,d<V_1 B_2),AND(d>V_2 B_1,d<V_2 B_2),AND(d>V_3 B_1,d<V_3 B_2),AND(d>V_4 B_1,d<V_4 B_2),AND(d>V_5 B_1,d<V_5 B_2),AND(d>V_6 B_1,d<V_6 B_2)),d,0)","v":0},{"$f":"IF(OR(AND(d>V_1 C_1,d<V_1 C_2),AND(d>V_2 C_1,d<V_2 C_2),AND(d>V_3 C_1,d<V_3 C_2),AND(d>V_4 C_1,d<V_4 C_2),AND(d>V_5 C_1,d<V_5 C_2),AND(d>V_6 C_1,d<V_6 C_2)),d,0)","v":0},0,0]
[null,null,null,null,null,null,null,null,"2016-01-31",null,{"$f":"IF(OR(AND(d>V_1 A_1,d<V_1 A_2),AND(d>V_2 A_1,d<V_2 A_2),AND(d>V_3 A_1,d<V_3 A_2),AND(d>V_4 A_1,d<V_4 A_2),AND(d>V_5 A_1,d<V_5 A_2),AND(d>V_6 A_1,d<V_6 A_2)),d,0)","v":0},{"$f":"IF(OR(AND(d>V_1 B_1,d<V_1 B_2),AND(d>V_2 B_1,d<V_2 B_2),AND(d>V_3 B_1,d<V_3 B_2),AND(d>V_4 B_1,d<V_4 B_2),AND(d>V_5 B_1,d<V_5 B_2),AND(d>V_6 B_1,d<V_6 B_2)),d,0)","v":0},{"$f":"IF(OR(AND(d>V_1 C_1,d<V_1 C_2),AND(d>V_2 C_1,d<V_2 C_2),AND(d>V_3 C_1,d<V_3 C_2),AND(d>V_4 C_1,d<V_4 C_2),AND(d>V_5 C_1,d<V_5 C_2),AND(d>V_6 C_1,d<V_6 C_2)),d,0)","v":0},0,0]
[null,null,null,null,null,null,null,null,"2016-02-01",null,{"$f":"IF(OR(AND(d>V_1 A_1,d<V_1 A_2),AND(d>V_2 A_1,d<V_2 A_2),AND(d>V_3 A_1,d<V_3 A_2),AND(d>V_4 A_1,d<V_4 A_2),AND(d>V_5 A_1,d<V_5 A_2),AND(d>V_6 A_1,d<V_6 A_2)),d,0)","v":0},{"$f":"IF(OR(AND(d>V_1 B_1,d<V_1 B_2),AND(d>V_2 B_1,d<V_2 B_2),AND(d>V_3 B_1,d<V_3 B_2),AND(d>V_4 B_1,d<V_4 B_2),AND(d>V_5 B_1,d<V_5 B_2),AND(d>V_6 B_1,d<V_6 B_2)),d,0)","v":0},{"$f":"IF(OR(AND(d>V_1 C_1,d<V_1 C_2),AND(d>V_2 C_1,d<V_2 C_2),AND(d>V_3 C_1,d<V_3 C_2),AND(d>V_4 C_1,d<V_4 C_2),AND(d>V_5 C_1,d<V_5 C_2),AND(d>V_6 C_1,d<V_6 C_2)),d,0)","v":0},0,0]
[null,null,null,null,null,null,null,null,"2016-02-02",null,{"$f":"IF(OR(AND(d>V_1 A_1,d<V_1 A_2),AND(d>V_2 A_1,d<V_2 A_2),AND(d>V_3 A_1,d<V_3 A_2),AND(d>V_4 A_1,d<V_4 A_2),AND(d>V_5 A_1,d<V_5 A_2),AND(d>V_6 A_1,d<V_6 A_2)),d,0)","v":0},{"$f":"IF(OR(AND(d>V_1 B_1,d<V_1 B_2),AND(d>V_2 B_1,d<V_2 B_2),AND(d>V_3 B_1,d<V_3 B_2),AND(d>V_4 B_1,d<V_4 B_2),AND(d>V_5 B_1,d<V_5 B_2),AND(d>V_6 B_1,d<V_6 B_2)),d,0)","v":0},{"$f":"IF(OR(AND(d>V_1 C_1,d<V_1 C_2),AND(d>V_2 C_1,d<V_2 C_2),AND(d>V_3 C_1,d<V_3 C_2),AND(d>V_4 C_1,d<V_4 C_2),AND(d>V_5 C_1,d<V_5 C_2),AND(d>V_6 C_1,d<V_6 C_2)),d,0)","v":0},0,0]
[null,null,null,null,null,null,null,null,"2016-02-03",null,{"$f":"IF(OR(AND(d>V_1 A_1,d<V_1 A_2),AND(d>V_2 A_1,d<V_2 A_2),AND(d>V_3 A_1,d<V_3 A_2),AND(d>V_4 A_1,d<V_4 A_2),AND(d>V_5 A_1,d<V_5 A_2),AND(d>V_6 A_1,d<V_6 A_2)),d,0)","v":0},{"$f":"IF(OR(AND(d>V_1 B_1,d<V_1 B_2),AND(d>V_2 B_1,d<V_2 B_2),AND(d>V_3 B_1,d<V_3 B_2),AND(d>V_4 B_1,d<V_4 B_2),AND(d>V_5 B_1,d<V_5 B_2),AND(d>V_6 B_1,d<V_6 B_2)),d,0)","v":0},{"$f":"IF(OR(AND(d>V_1 C_1,d<V_1 C_2),AND(d>V_2 C_1,d<V_2 C_2),AND(d>V_3 C_1,d<V_3 C_2),AND(d>V_4 C_1,d<V_4 C_2),AND(d>V_5 C_1,d<V_5 C_2),AND(d>V_6 C_1,d<V_6 C_2)),d,0)","v":0},0,0]
[null,null,null,null,null,null,null,null,"2016-02-04",null,{"$f":"IF(OR(AND(d>V_1 A_1,d<V_1 A_2),AND(d>V_2 A_1,d<V_2 A_2),AND(d>V_3 A_1,d<V_3 A_2),AND(d>V_4 A_1,d<V_4 A_2),AND(d>V_5 A_1,d<V_5 A_2),AND(d>V_6 A_1,d<V_6 A_2)),d,0)","v":0},{"$f":"IF(OR(AND(d>V_1 B_1,d<V_1 B_2),AND(d>V_2 B_1,d<V_2 B_2),AND(d>V_3 B_1,d<V_3 B_2),AND(d>V_4 B_1,d<V_4 B_2),AND(d>V_5 B_1,d<V_5 B_2),AND(d>V_6 B_1,d<V_6 B_2)),d,0)","v":0},{"$f":"IF(OR(AND(d>V_1 C_1,d<V_1 C_2),AND(d>V_2 C_1,d<V_2 C_2),AND(d>V_3 C_1,d<V_3 C_2),AND(d>V_4 C_1,d<V_4 C_2),AND(d>V_5 C_1,d<V_5 C_2),AND(d>V_6 C_1,d<V_6 C_2)),d,0)","v":0},0,0]
[null,null,null,null,null,null,null,null,"2016-02-05",null,{"$f":"IF(OR(AND(d>V_1 A_1,d<V_1 A_2),AND(d>V_2 A_1,d<V_2 A_2),AND(d>V_3 A_1,d<V_3 A_2),AND(d>V_4 A_1,d<V_4 A_2),AND(d>V_5 A_1,d<V_5 A_2),AND(d>V_6 A_1,d<V_6 A_2)),d,0)","v":0},{"$f":"IF(OR(AND(d>V_1 B_1,d<V_1 B_2),AND(d>V_2 B_1,d<V_2 B_2),AND(d>V_3 B_1,d<V_3 B_2),AND(d>V_4 B_1,d<V_4 B_2),AND(d>V_5 B_1,d<V_5 B_2),AND(d>V_6 B_1,d<V_6 B_2)),d,0)","v":0},{"$f":"IF(OR(AND(d>V_1 C_1,d<V_1 C_2),AND(d>V_2 C_1,d<V_2 C_2),AND(d>V_3 C_1,d<V_3 C_2),AND(d>V_4 C_1,d<V_4 C_2),AND(d>V_5 C_1,d<V_5 C_2),AND(d>V_6 C_1,d<V_6 C_2)),d,0)","v":0},0,0]
[null,null,null,null,null,null,null,null,"2016-02-06",null,{"$f":"IF(OR(AND(d>V_1 A_1,d<V_1 A_2),AND(d>V_2 A_1,d<V_2 A_2),AND(d>V_3 A_1,d<V_3 A_2),AND(d>V_4 A_1,d<V_4 A_2),AND(d>V_5 A_1,d<V_5 A_2),AND(d>V_6 A_1,d<V_6 A_2)),d,0)","v":0},{"$f":"IF(OR(AND(d>V_1 B_1,d<V_1 B_2),AND(d>V_2 B_1,d<V_2 B_2),AND(d>V_3 B_1,d<V_3 B_2),AND(d>V_4 B_1,d<V_4 B_2),AND(d>V_5 B_1,d<V_5 B_2),AND(d>V_6 B_1,d<V_6 B_2)),d,0)","v":0},{"$f":"IF(OR(AND(d>V_1 C_1,d<V_1 C_2),AND(d>V_2 C_1,d<V_2 C_2),AND(d>V_3 C_1,d<V_3 C_2),AND(d>V_4 C_1,d<V_4 C_2),AND(d>V_5 C_1,d<V_5 C_2),AND(d>V_6 C_1,d<V_6 C_2)),d,0)","v":0},0,0]
[null,null,null,null,null,null,null,null,"2016-02-07",null,{"$f":"IF(OR(AND(d>V_1 A_1,d<V_1 A_2),AND(d>V_2 A_1,d<V_2 A_2),AND(d>V_3 A_1,d<V_3 A_2),AND(d>V_4 A_1,d<V_4 A_2),AND(d>V_5 A_1,d<V_5 A_2),AND(d>V_6 A_1,d<V_6 A_2)),d,0)","v":0},{"$f":"IF(OR(AND(d>V_1 B_1,d<V_1 B_2),AND(d>V_2 B_1,d<V_2 B_2),AND(d>V_3 B_1,d<V_3 B_2),AND(d>V_4 B_1,d<V_4 B_2),AND(d>V_5 B_1,d<V_5 B_2),AND(d>V_6 B_1,d<V_6 B_2)),d,0)","v":42407},{"$f":"IF(OR(AND(d>V_1 C_1,d<V_1 C_2),AND(d>V_2 C_1,d<V_2 C_2),AND(d>V_3 C_1,d<V_3 C_2),AND(d>V_4 C_1,d<V_4 C_2),AND(d>V_5 C_1,d<V_5 C_2),AND(d>V_6 C_1,d<V_6 C_2)),d,0)","v":0},42407,0]
[null,null,null,null,null,null,null,null,"2016-02-08",null,{"$f":"IF(OR(AND(d>V_1 A_1,d<V_1 A_2),AND(d>V_2 A_1,d<V_2 A_2),AND(d>V_3 A_1,d<V_3 A_2),AND(d>V_4 A_1,d<V_4 A_2),AND(d>V_5 A_1,d<V_5 A_2),AND(d>V_6 A_1,d<V_6 A_2)),d,0)","v":0},{"$f":"IF(OR(AND(d>V_1 B_1,d<V_1 B_2),AND(d>V_2 B_1,d<V_2 B_2),AND(d>V_3 B_1,d<V_3 B_2),AND(d>V_4 B_1,d<V_4 B_2),AND(d>V_5 B_1,d<V_5 B_2),AND(d>V_6 B_1,d<V_6 B_2)),d,0)","v":42408},{"$f":"IF(OR(AND(d>V_1 C_1,d<V_1 C_2),AND(d>V_2 C_1,d<V_2 C_2),AND(d>V_3 C_1,d<V_3 C_2),AND(d>V_4 C_1,d<V_4 C_2),AND(d>V_5 C_1,d<V_5 C_2),AND(d>V_6 C_1,d<V_6 C_2)),d,0)","v":0},42408,0]
[null,null,null,null,null,null,null,null,"2016-02-09",null,{"$f":"IF(OR(AND(d>V_1 A_1,d<V_1 A_2),AND(d>V_2 A_1,d<V_2 A_2),AND(d>V_3 A_1,d<V_3 A_2),AND(d>V_4 A_1,d<V_4 A_2),AND(d>V_5 A_1,d<V_5 A_2),AND(d>V_6 A_1,d<V_6 A_2)),d,0)","v":0},{"$f":"IF(OR(AND(d>V_1 B_1,d<V_1 B_2),AND(d>V_2 B_1,d<V_2 B_2),AND(d>V_3 B_1,d<V_3 B_2),AND(d>V_4 B_1,d<V_4 B_2),AND(d>V_5 B_1,d<V_5 B_2),AND(d>V_6 B_1,d<V_6 B_2)),d,0)","v":42409},{"$f":"IF(OR(AND(d>V_1 C_1,d<V_1 C_2),AND(d>V_2 C_1,d<V_2 C_2),AND(d>V_3 C_1,d<V_3 C_2),AND(d>V_4 C_1,d<V_4 C_2),AND(d>V_5 C_1,d<V_5 C_2),AND(d>V_6 C_1,d<V_6 C_2)),d,0)","v":0},42409,0]
[null,null,null,null,null,null,null,null,"2016-02-10",null,{"$f":"IF(OR(AND(d>V_1 A_1,d<V_1 A_2),AND(d>V_2 A_1,d<V_2 A_2),AND(d>V_3 A_1,d<V_3 A_2),AND(d>V_4 A_1,d<V_4 A_2),AND(d>V_5 A_1,d<V_5 A_2),AND(d>V_6 A_1,d<V_6 A_2)),d,0)","v":0},{"$f":"IF(OR(AND(d>V_1 B_1,d<V_1 B_2),AND(d>V_2 B_1,d<V_2 B_2),AND(d>V_3 B_1,d<V_3 B_2),AND(d>V_4 B_1,d<V_4 B_2),AND(d>V_5 B_1,d<V_5 B_2),AND(d>V_6 B_1,d<V_6 B_2)),d,0)","v":42410},{"$f":"IF(OR(AND(d>V_1 C_1,d<V_1 C_2),AND(d>V_2 C_1,d<V_2 C_2),AND(d>V_3 C_1,d<V_3 C_2),AND(d>V_4 C_1,d<V_4 C_2),AND(d>V_5 C_1,d<V_5 C_2),AND(d>V_6 C_1,d<V_6 C_2)),d,0)","v":0},42410,0]
[null,null,null,null,null,null,null,null,"2016-02-11",null,{"$f":"IF(OR(AND(d>V_1 A_1,d<V_1 A_2),AND(d>V_2 A_1,d<V_2 A_2),AND(d>V_3 A_1,d<V_3 A_2),AND(d>V_4 A_1,d<V_4 A_2),AND(d>V_5 A_1,d<V_5 A_2),AND(d>V_6 A_1,d<V_6 A_2)),d,0)","v":0},{"$f":"IF(OR(AND(d>V_1 B_1,d<V_1 B_2),AND(d>V_2 B_1,d<V_2 B_2),AND(d>V_3 B_1,d<V_3 B_2),AND(d>V_4 B_1,d<V_4 B_2),AND(d>V_5 B_1,d<V_5 B_2),AND(d>V_6 B_1,d<V_6 B_2)),d,0)","v":42411},{"$f":"IF(OR(AND(d>V_1 C_1,d<V_1 C_2),AND(d>V_2 C_1,d<V_2 C_2),AND(d>V_3 C_1,d<V_3 C_2),AND(d>V_4 C_1,d<V_4 C_2),AND(d>V_5 C_1,d<V_5 C_2),AND(d>V_6 C_1,d<V_6 C_2)),d,0)","v":0},42411,0]
[null,null,null,null,null,null,null,null,"2016-02-12",null,{"$f":"IF(OR(AND(d>V_1 A_1,d<V_1 A_2),AND(d>V_2 A_1,d<V_2 A_2),AND(d>V_3 A_1,d<V_3 A_2),AND(d>V_4 A_1,d<V_4 A_2),AND(d>V_5 A_1,d<V_5 A_2),AND(d>V_6 A_1,d<V_6 A_2)),d,0)","v":0},{"$f":"IF(OR(AND(d>V_1 B_1,d<V_1 B_2),AND(d>V_2 B_1,d<V_2 B_2),AND(d>V_3 B_1,d<V_3 B_2),AND(d>V_4 B_1,d<V_4 B_2),AND(d>V_5 B_1,d<V_5 B_2),AND(d>V_6 B_1,d<V_6 B_2)),d,0)","v":42412},{"$f":"IF(OR(AND(d>V_1 C_1,d<V_1 C_2),AND(d>V_2 C_1,d<V_2 C_2),AND(d>V_3 C_1,d<V_3 C_2),AND(d>V_4 C_1,d<V_4 C_2),AND(d>V_5 C_1,d<V_5 C_2),AND(d>V_6 C_1,d<V_6 C_2)),d,0)","v":0},42412,0]
[null,null,null,null,null,null,null,null,"2016-02-13",null,{"$f":"IF(OR(AND(d>V_1 A_1,d<V_1 A_2),AND(d>V_2 A_1,d<V_2 A_2),AND(d>V_3 A_1,d<V_3 A_2),AND(d>V_4 A_1,d<V_4 A_2),AND(d>V_5 A_1,d<V_5 A_2),AND(d>V_6 A_1,d<V_6 A_2)),d,0)","v":0},{"$f":"IF(OR(AND(d>V_1 B_1,d<V_1 B_2),AND(d>V_2 B_1,d<V_2 B_2),AND(d>V_3 B_1,d<V_3 B_2),AND(d>V_4 B_1,d<V_4 B_2),AND(d>V_5 B_1,d<V_5 B_2),AND(d>V_6 B_1,d<V_6 B_2)),d,0)","v":42413},{"$f":"IF(OR(AND(d>V_1 C_1,d<V_1 C_2),AND(d>V_2 C_1,d<V_2 C_2),AND(d>V_3 C_1,d<V_3 C_2),AND(d>V_4 C_1,d<V_4 C_2),AND(d>V_5 C_1,d<V_5 C_2),AND(d>V_6 C_1,d<V_6 C_2)),d,0)","v":0},42413,0]
[null,null,null,null,null,null,null,null,"2016-02-14",null,{"$f":"IF(OR(AND(d>V_1 A_1,d<V_1 A_2),AND(d>V_2 A_1,d<V_2 A_2),AND(d>V_3 A_1,d<V_3 A_2),AND(d>V_4 A_1,d<V_4 A_2),AND(d>V_5 A_1,d<V_5 A_2),AND(d>V_6 A_1,d<V_6 A_2)),d,0)","v":42414},{"$f":"IF(OR(AND(d>V_1 B_1,d<V_1 B_2),AND(d>V_2 B_1,d<V_2 B_2),AND(d>V_3 B_1,d<V_3 B_2),AND(d>V_4 B_1,d<V_4 B_2),AND(d>V_5 B_1,d<V_5 B_2),AND(d>V_6 B_1,d<V_6 B_2)),d,0)","v":42414},{"$f":"IF(OR(AND(d>V_1 C_1,d<V_1 C_2),AND(d>V_2 C_1,d<V_2 C_2),AND(d>V_3 C_1,d<V_3 C_2),AND(d>V_4 C_1,d<V_4 C_2),AND(d>V_5 C_1,d<V_5 C_2),AND(d>V_6 C_1,d<V_6 C_2)),d,0)","v":0},42414,0]
[null,null,null,null,null,null,null,null,"2016-02-15",null,{"$f":"IF(OR(AND(d>V_1 A_1,d<V_1 A_2),AND(d>V_2 A_1,d<V_2 A_2),AND(d>V_3 A_1,d<V_3 A_2),AND(d>V_4 A_1,d<V_4 A_2),AND(d>V_5 A_1,d<V_5 A_2),AND(d>V_6 A_1,d<V_6 A_2)),d,0)","v":42415},{"$f":"IF(OR(AND(d>V_1 B_1,d<V_1 B_2),AND(d>V_2 B_1,d<V_2 B_2),AND(d>V_3 B_1,d<V_3 B_2),AND(d>V_4 B_1,d<V_4 B_2),AND(d>V_5 B_1,d<V_5 B_2),AND(d>V_6 B_1,d<V_6 B_2)),d,0)","v":42415},{"$f":"IF(OR(AND(d>V_1 C_1,d<V_1 C_2),AND(d>V_2 C_1,d<V_2 C_2),AND(d>V_3 C_1,d<V_3 C_2),AND(d>V_4 C_1,d<V_4 C_2),AND(d>V_5 C_1,d<V_5 C_2),AND(d>V_6 C_1,d<V_6 C_2)),d,0)","v":0},42415,0]
[null,null,null,null,null,null,null,null,"2016-02-16",null,{"$f":"IF(OR(AND(d>V_1 A_1,d<V_1 A_2),AND(d>V_2 A_1,d<V_2 A_2),AND(d>V_3 A_1,d<V_3 A_2),AND(d>V_4 A_1,d<V_4 A_2),AND(d>V_5 A_1,d<V_5 A_2),AND(d>V_6 A_1,d<V_6 A_2)),d,0)","v":42416},{"$f":"IF(OR(AND(d>V_1 B_1,d<V_1 B_2),AND(d>V_2 B_1,d<V_2 B_2),AND(d>V_3 B_1,d<V_3 B_2),AND(d>V_4 B_1,d<V_4 B_2),AND(d>V_5 B_1,d<V_5 B_2),AND(d>V_6 B_1,d<V_6 B_2)),d,0)","v":42416},{"$f":"IF(OR(AND(d>V_1 C_1,d<V_1 C_2),AND(d>V_2 C_1,d<V_2 C_2),AND(d>V_3 C_1,d<V_3 C_2),AND(d>V_4 C_1,d<V_4 C_2),AND(d>V_5 C_1,d<V_5 C_2),AND(d>V_6 C_1,d<V_6 C_2)),d,0)","v":0},42416,0]
[null,null,null,null,null,null,null,null,"2016-02-17",null,{"$f":"IF(OR(AND(d>V_1 A_1,d<V_1 A_2),AND(d>V_2 A_1,d<V_2 A_2),AND(d>V_3 A_1,d<V_3 A_2),AND(d>V_4 A_1,d<V_4 A_2),AND(d>V_5 A_1,d<V_5 A_2),AND(d>V_6 A_1,d<V_6 A_2)),d,0)","v":42417},{"$f":"IF(OR(AND(d>V_1 B_1,d<V_1 B_2),AND(d>V_2 B_1,d<V_2 B_2),AND(d>V_3 B_1,d<V_3 B_2),AND(d>V_4 B_1,d<V_4 B_2),AND(d>V_5 B_1,d<V_5 B_2),AND(d>V_6 B_1,d<V_6 B_2)),d,0)","v":42417},{"$f":"IF(OR(AND(d>V_1 C_1,d<V_1 C_2),AND(d>V_2 C_1,d<V_2 C_2),AND(d>V_3 C_1,d<V_3 C_2),AND(d>V_4 C_1,d<V_4 C_2),AND(d>V_5 C_1,d<V_5 C_2),AND(d>V_6 C_1,d<V_6 C_2)),d,0)","v":0},42417,0]
[null,null,null,null,null,null,null,null,"2016-02-18",null,{"$f":"IF(OR(AND(d>V_1 A_1,d<V_1 A_2),AND(d>V_2 A_1,d<V_2 A_2),AND(d>V_3 A_1,d<V_3 A_2),AND(d>V_4 A_1,d<V_4 A_2),AND(d>V_5 A_1,d<V_5 A_2),AND(d>V_6 A_1,d<V_6 A_2)),d,0)","v":42418},{"$f":"IF(OR(AND(d>V_1 B_1,d<V_1 B_2),AND(d>V_2 B_1,d<V_2 B_2),AND(d>V_3 B_1,d<V_3 B_2),AND(d>V_4 B_1,d<V_4 B_2),AND(d>V_5 B_1,d<V_5 B_2),AND(d>V_6 B_1,d<V_6 B_2)),d,0)","v":42418},{"$f":"IF(OR(AND(d>V_1 C_1,d<V_1 C_2),AND(d>V_2 C_1,d<V_2 C_2),AND(d>V_3 C_1,d<V_3 C_2),AND(d>V_4 C_1,d<V_4 C_2),AND(d>V_5 C_1,d<V_5 C_2),AND(d>V_6 C_1,d<V_6 C_2)),d,0)","v":0},42418,0]
[null,null,null,null,null,null,null,null,"2016-02-19",null,{"$f":"IF(OR(AND(d>V_1 A_1,d<V_1 A_2),AND(d>V_2 A_1,d<V_2 A_2),AND(d>V_3 A_1,d<V_3 A_2),AND(d>V_4 A_1,d<V_4 A_2),AND(d>V_5 A_1,d<V_5 A_2),AND(d>V_6 A_1,d<V_6 A_2)),d,0)","v":42419},{"$f":"IF(OR(AND(d>V_1 B_1,d<V_1 B_2),AND(d>V_2 B_1,d<V_2 B_2),AND(d>V_3 B_1,d<V_3 B_2),AND(d>V_4 B_1,d<V_4 B_2),AND(d>V_5 B_1,d<V_5 B_2),AND(d>V_6 B_1,d<V_6 B_2)),d,0)","v":42419},{"$f":"IF(OR(AND(d>V_1 C_1,d<V_1 C_2),AND(d>V_2 C_1,d<V_2 C_2),AND(d>V_3 C_1,d<V_3 C_2),AND(d>V_4 C_1,d<V_4 C_2),AND(d>V_5 C_1,d<V_5 C_2),AND(d>V_6 C_1,d<V_6 C_2)),d,0)","v":0},42419,0]
[null,null,null,null,null,null,null,null,"2016-02-20",null,{"$f":"IF(OR(AND(d>V_1 A_1,d<V_1 A_2),AND(d>V_2 A_1,d<V_2 A_2),AND(d>V_3 A_1,d<V_3 A_2),AND(d>V_4 A_1,d<V_4 A_2),AND(d>V_5 A_1,d<V_5 A_2),AND(d>V_6 A_1,d<V_6 A_2)),d,0)","v":42420},{"$f":"IF(OR(AND(d>V_1 B_1,d<V_1 B_2),AND(d>V_2 B_1,d<V_2 B_2),AND(d>V_3 B_1,d<V_3 B_2),AND(d>V_4 B_1,d<V_4 B_2),AND(d>V_5 B_1,d<V_5 B_2),AND(d>V_6 B_1,d<V_6 B_2)),d,0)","v":42420},{"$f":"IF(OR(AND(d>V_1 C_1,d<V_1 C_2),AND(d>V_2 C_1,d<V_2 C_2),AND(d>V_3 C_1,d<V_3 C_2),AND(d>V_4 C_1,d<V_4 C_2),AND(d>V_5 C_1,d<V_5 C_2),AND(d>V_6 C_1,d<V_6 C_2)),d,0)","v":0},42420,0]
[null,null,null,null,null,null,null,null,"2016-02-21",null,{"$f":"IF(OR(AND(d>V_1 A_1,d<V_1 A_2),AND(d>V_2 A_1,d<V_2 A_2),AND(d>V_3 A_1,d<V_3 A_2),AND(d>V_4 A_1,d<V_4 A_2),AND(d>V_5 A_1,d<V_5 A_2),AND(d>V_6 A_1,d<V_6 A_2)),d,0)","v":42421},{"$f":"IF(OR(AND(d>V_1 B_1,d<V_1 B_2),AND(d>V_2 B_1,d<V_2 B_2),AND(d>V_3 B_1,d<V_3 B_2),AND(d>V_4 B_1,d<V_4 B_2),AND(d>V_5 B_1,d<V_5 B_2),AND(d>V_6 B_1,d<V_6 B_2)),d,0)","v":42421},{"$f":"IF(OR(AND(d>V_1 C_1,d<V_1 C_2),AND(d>V_2 C_1,d<V_2 C_2),AND(d>V_3 C_1,d<V_3 C_2),AND(d>V_4 C_1,d<V_4 C_2),AND(d>V_5 C_1,d<V_5 C_2),AND(d>V_6 C_1,d<V_6 C_2)),d,0)","v":42421},42421,42421]
[null,null,null,null,null,null,null,null,"2016-02-22",null,{"$f":"IF(OR(AND(d>V_1 A_1,d<V_1 A_2),AND(d>V_2 A_1,d<V_2 A_2),AND(d>V_3 A_1,d<V_3 A_2),AND(d>V_4 A_1,d<V_4 A_2),AND(d>V_5 A_1,d<V_5 A_2),AND(d>V_6 A_1,d<V_6 A_2)),d,0)","v":42422},{"$f":"IF(OR(AND(d>V_1 B_1,d<V_1 B_2),AND(d>V_2 B_1,d<V_2 B_2),AND(d>V_3 B_1,d<V_3 B_2),AND(d>V_4 B_1,d<V_4 B_2),AND(d>V_5 B_1,d<V_5 B_2),AND(d>V_6 B_1,d<V_6 B_2)),d,0)","v":0},{"$f":"IF(OR(AND(d>V_1 C_1,d<V_1 C_2),AND(d>V_2 C_1,d<V_2 C_2),AND(d>V_3 C_1,d<V_3 C_2),AND(d>V_4 C_1,d<V_4 C_2),AND(d>V_5 C_1,d<V_5 C_2),AND(d>V_6 C_1,d<V_6 C_2)),d,0)","v":42422},42422,42422]
[null,null,null,null,null,null,null,null,"2016-02-23",null,{"$f":"IF(OR(AND(d>V_1 A_1,d<V_1 A_2),AND(d>V_2 A_1,d<V_2 A_2),AND(d>V_3 A_1,d<V_3 A_2),AND(d>V_4 A_1,d<V_4 A_2),AND(d>V_5 A_1,d<V_5 A_2),AND(d>V_6 A_1,d<V_6 A_2)),d,0)","v":42423},{"$f":"IF(OR(AND(d>V_1 B_1,d<V_1 B_2),AND(d>V_2 B_1,d<V_2 B_2),AND(d>V_3 B_1,d<V_3 B_2),AND(d>V_4 B_1,d<V_4 B_2),AND(d>V_5 B_1,d<V_5 B_2),AND(d>V_6 B_1,d<V_6 B_2)),d,0)","v":0},{"$f":"IF(OR(AND(d>V_1 C_1,d<V_1 C_2),AND(d>V_2 C_1,d<V_2 C_2),AND(d>V_3 C_1,d<V_3 C_2),AND(d>V_4 C_1,d<V_4 C_2),AND(d>V_5 C_1,d<V_5 C_2),AND(d>V_6 C_1,d<V_6 C_2)),d,0)","v":42423},42423,42423]
[null,null,null,null,null,null,null,null,"2016-02-24",null,{"$f":"IF(OR(AND(d>V_1 A_1,d<V_1 A_2),AND(d>V_2 A_1,d<V_2 A_2),AND(d>V_3 A_1,d<V_3 A_2),AND(d>V_4 A_1,d<V_4 A_2),AND(d>V_5 A_1,d<V_5 A_2),AND(d>V_6 A_1,d<V_6 A_2)),d,0)","v":42424},{"$f":"IF(OR(AND(d>V_1 B_1,d<V_1 B_2),AND(d>V_2 B_1,d<V_2 B_2),AND(d>V_3 B_1,d<V_3 B_2),AND(d>V_4 B_1,d<V_4 B_2),AND(d>V_5 B_1,d<V_5 B_2),AND(d>V_6 B_1,d<V_6 B_2)),d,0)","v":0},{"$f":"IF(OR(AND(d>V_1 C_1,d<V_1 C_2),AND(d>V_2 C_1,d<V_2 C_2),AND(d>V_3 C_1,d<V_3 C_2),AND(d>V_4 C_1,d<V_4 C_2),AND(d>V_5 C_1,d<V_5 C_2),AND(d>V_6 C_1,d<V_6 C_2)),d,0)","v":42424},42424,42424]
[null,null,null,null,null,null,null,null,"2016-02-25",null,{"$f":"IF(OR(AND(d>V_1 A_1,d<V_1 A_2),AND(d>V_2 A_1,d<V_2 A_2),AND(d>V_3 A_1,d<V_3 A_2),AND(d>V_4 A_1,d<V_4 A_2),AND(d>V_5 A_1,d<V_5 A_2),AND(d>V_6 A_1,d<V_6 A_2)),d,0)","v":42425},{"$f":"IF(OR(AND(d>V_1 B_1,d<V_1 B_2),AND(d>V_2 B_1,d<V_2 B_2),AND(d>V_3 B_1,d<V_3 B_2),AND(d>V_4 B_1,d<V_4 B_2),AND(d>V_5 B_1,d<V_5 B_2),AND(d>V_6 B_1,d<V_6 B_2)),d,0)","v":0},{"$f":"IF(OR(AND(d>V_1 C_1,d<V_1 C_2),AND(d>V_2 C_1,d<V_2 C_2),AND(d>V_3 C_1,d<V_3 C_2),AND(d>V_4 C_1,d<V_4 C_2),AND(d>V_5 C_1,d<V_5 C_2),AND(d>V_6 C_1,d<V_6 C_2)),d,0)","v":42425},42425,42425]
[null,null,null,null,null,null,null,null,"2016-02-26",null,{"$f":"IF(OR(AND(d>V_1 A_1,d<V_1 A_2),AND(d>V_2 A_1,d<V_2 A_2),AND(d>V_3 A_1,d<V_3 A_2),AND(d>V_4 A_1,d<V_4 A_2),AND(d>V_5 A_1,d<V_5 A_2),AND(d>V_6 A_1,d<V_6 A_2)),d,0)","v":42426},{"$f":"IF(OR(AND(d>V_1 B_1,d<V_1 B_2),AND(d>V_2 B_1,d<V_2 B_2),AND(d>V_3 B_1,d<V_3 B_2),AND(d>V_4 B_1,d<V_4 B_2),AND(d>V_5 B_1,d<V_5 B_2),AND(d>V_6 B_1,d<V_6 B_2)),d,0)","v":0},{"$f":"IF(OR(AND(d>V_1 C_1,d<V_1 C_2),AND(d>V_2 C_1,d<V_2 C_2),AND(d>V_3 C_1,d<V_3 C_2),AND(d>V_4 C_1,d<V_4 C_2),AND(d>V_5 C_1,d<V_5 C_2),AND(d>V_6 C_1,d<V_6 C_2)),d,0)","v":42426},42426,42426]
[null,null,null,null,null,null,null,null,"2016-02-27",null,{"$f":"IF(OR(AND(d>V_1 A_1,d<V_1 A_2),AND(d>V_2 A_1,d<V_2 A_2),AND(d>V_3 A_1,d<V_3 A_2),AND(d>V_4 A_1,d<V_4 A_2),AND(d>V_5 A_1,d<V_5 A_2),AND(d>V_6 A_1,d<V_6 A_2)),d,0)","v":42427},{"$f":"IF(OR(AND(d>V_1 B_1,d<V_1 B_2),AND(d>V_2 B_1,d<V_2 B_2),AND(d>V_3 B_1,d<V_3 B_2),AND(d>V_4 B_1,d<V_4 B_2),AND(d>V_5 B_1,d<V_5 B_2),AND(d>V_6 B_1,d<V_6 B_2)),d,0)","v":0},{"$f":"IF(OR(AND(d>V_1 C_1,d<V_1 C_2),AND(d>V_2 C_1,d<V_2 C_2),AND(d>V_3 C_1,d<V_3 C_2),AND(d>V_4 C_1,d<V_4 C_2),AND(d>V_5 C_1,d<V_5 C_2),AND(d>V_6 C_1,d<V_6 C_2)),d,0)","v":42427},42427,42427]
[null,null,null,null,null,null,null,null,"2016-02-28",null,{"$f":"IF(OR(AND(d>V_1 A_1,d<V_1 A_2),AND(d>V_2 A_1,d<V_2 A_2),AND(d>V_3 A_1,d<V_3 A_2),AND(d>V_4 A_1,d<V_4 A_2),AND(d>V_5 A_1,d<V_5 A_2),AND(d>V_6 A_1,d<V_6 A_2)),d,0)","v":42428},{"$f":"IF(OR(AND(d>V_1 B_1,d<V_1 B_2),AND(d>V_2 B_1,d<V_2 B_2),AND(d>V_3 B_1,d<V_3 B_2),AND(d>V_4 B_1,d<V_4 B_2),AND(d>V_5 B_1,d<V_5 B_2),AND(d>V_6 B_1,d<V_6 B_2)),d,0)","v":0},{"$f":"IF(OR(AND(d>V_1 C_1,d<V_1 C_2),AND(d>V_2 C_1,d<V_2 C_2),AND(d>V_3 C_1,d<V_3 C_2),AND(d>V_4 C_1,d<V_4 C_2),AND(d>V_5 C_1,d<V_5 C_2),AND(d>V_6 C_1,d<V_6 C_2)),d,0)","v":42428},42428,42428]
[null,null,null,null,null,null,null,null,"2016-02-29",null,{"$f":"IF(OR(AND(d>V_1 A_1,d<V_1 A_2),AND(d>V_2 A_1,d<V_2 A_2),AND(d>V_3 A_1,d<V_3 A_2),AND(d>V_4 A_1,d<V_4 A_2),AND(d>V_5 A_1,d<V_5 A_2),AND(d>V_6 A_1,d<V_6 A_2)),d,0)","v":0},{"$f":"IF(OR(AND(d>V_1 B_1,d<V_1 B_2),AND(d>V_2 B_1,d<V_2 B_2),AND(d>V_3 B_1,d<V_3 B_2),AND(d>V_4 B_1,d<V_4 B_2),AND(d>V_5 B_1,d<V_5 B_2),AND(d>V_6 B_1,d<V_6 B_2)),d,0)","v":0},{"$f":"IF(OR(AND(d>V_1 C_1,d<V_1 C_2),AND(d>V_2 C_1,d<V_2 C_2),AND(d>V_3 C_1,d<V_3 C_2),AND(d>V_4 C_1,d<V_4 C_2),AND(d>V_5 C_1,d<V_5 C_2),AND(d>V_6 C_1,d<V_6 C_2)),d,0)","v":42429},42429,42429]
[null,null,null,null,null,null,null,null,"2016-03-01",null,{"$f":"IF(OR(AND(d>V_1 A_1,d<V_1 A_2),AND(d>V_2 A_1,d<V_2 A_2),AND(d>V_3 A_1,d<V_3 A_2),AND(d>V_4 A_1,d<V_4 A_2),AND(d>V_5 A_1,d<V_5 A_2),AND(d>V_6 A_1,d<V_6 A_2)),d,0)","v":0},{"$f":"IF(OR(AND(d>V_1 B_1,d<V_1 B_2),AND(d>V_2 B_1,d<V_2 B_2),AND(d>V_3 B_1,d<V_3 B_2),AND(d>V_4 B_1,d<V_4 B_2),AND(d>V_5 B_1,d<V_5 B_2),AND(d>V_6 B_1,d<V_6 B_2)),d,0)","v":0},{"$f":"IF(OR(AND(d>V_1 C_1,d<V_1 C_2),AND(d>V_2 C_1,d<V_2 C_2),AND(d>V_3 C_1,d<V_3 C_2),AND(d>V_4 C_1,d<V_4 C_2),AND(d>V_5 C_1,d<V_5 C_2),AND(d>V_6 C_1,d<V_6 C_2)),d,0)","v":42430},42430,42430]
[null,null,null,null,null,null,null,null,"2016-03-02",null,{"$f":"IF(OR(AND(d>V_1 A_1,d<V_1 A_2),AND(d>V_2 A_1,d<V_2 A_2),AND(d>V_3 A_1,d<V_3 A_2),AND(d>V_4 A_1,d<V_4 A_2),AND(d>V_5 A_1,d<V_5 A_2),AND(d>V_6 A_1,d<V_6 A_2)),d,0)","v":0},{"$f":"IF(OR(AND(d>V_1 B_1,d<V_1 B_2),AND(d>V_2 B_1,d<V_2 B_2),AND(d>V_3 B_1,d<V_3 B_2),AND(d>V_4 B_1,d<V_4 B_2),AND(d>V_5 B_1,d<V_5 B_2),AND(d>V_6 B_1,d<V_6 B_2)),d,0)","v":0},{"$f":"IF(OR(AND(d>V_1 C_1,d<V_1 C_2),AND(d>V_2 C_1,d<V_2 C_2),AND(d>V_3 C_1,d<V_3 C_2),AND(d>V_4 C_1,d<V_4 C_2),AND(d>V_5 C_1,d<V_5 C_2),AND(d>V_6 C_1,d<V_6 C_2)),d,0)","v":42431},42431,42431]
[null,null,null,null,null,null,null,null,"2016-03-03",null,{"$f":"IF(OR(AND(d>V_1 A_1,d<V_1 A_2),AND(d>V_2 A_1,d<V_2 A_2),AND(d>V_3 A_1,d<V_3 A_2),AND(d>V_4 A_1,d<V_4 A_2),AND(d>V_5 A_1,d<V_5 A_2),AND(d>V_6 A_1,d<V_6 A_2)),d,0)","v":0},{"$f":"IF(OR(AND(d>V_1 B_1,d<V_1 B_2),AND(d>V_2 B_1,d<V_2 B_2),AND(d>V_3 B_1,d<V_3 B_2),AND(d>V_4 B_1,d<V_4 B_2),AND(d>V_5 B_1,d<V_5 B_2),AND(d>V_6 B_1,d<V_6 B_2)),d,0)","v":0},{"$f":"IF(OR(AND(d>V_1 C_1,d<V_1 C_2),AND(d>V_2 C_1,d<V_2 C_2),AND(d>V_3 C_1,d<V_3 C_2),AND(d>V_4 C_1,d<V_4 C_2),AND(d>V_5 C_1,d<V_5 C_2),AND(d>V_6 C_1,d<V_6 C_2)),d,0)","v":42432},42432,42432]
[null,null,null,null,null,null,null,null,"2016-03-04",null,{"$f":"IF(OR(AND(d>V_1 A_1,d<V_1 A_2),AND(d>V_2 A_1,d<V_2 A_2),AND(d>V_3 A_1,d<V_3 A_2),AND(d>V_4 A_1,d<V_4 A_2),AND(d>V_5 A_1,d<V_5 A_2),AND(d>V_6 A_1,d<V_6 A_2)),d,0)","v":0},{"$f":"IF(OR(AND(d>V_1 B_1,d<V_1 B_2),AND(d>V_2 B_1,d<V_2 B_2),AND(d>V_3 B_1,d<V_3 B_2),AND(d>V_4 B_1,d<V_4 B_2),AND(d>V_5 B_1,d<V_5 B_2),AND(d>V_6 B_1,d<V_6 B_2)),d,0)","v":0},{"$f":"IF(OR(AND(d>V_1 C_1,d<V_1 C_2),AND(d>V_2 C_1,d<V_2 C_2),AND(d>V_3 C_1,d<V_3 C_2),AND(d>V_4 C_1,d<V_4 C_2),AND(d>V_5 C_1,d<V_5 C_2),AND(d>V_6 C_1,d<V_6 C_2)),d,0)","v":42433},42433,42433]
[null,null,null,null,null,null,null,null,"2016-03-05",null,{"$f":"IF(OR(AND(d>V_1 A_1,d<V_1 A_2),AND(d>V_2 A_1,d<V_2 A_2),AND(d>V_3 A_1,d<V_3 A_2),AND(d>V_4 A_1,d<V_4 A_2),AND(d>V_5 A_1,d<V_5 A_2),AND(d>V_6 A_1,d<V_6 A_2)),d,0)","v":0},{"$f":"IF(OR(AND(d>V_1 B_1,d<V_1 B_2),AND(d>V_2 B_1,d<V_2 B_2),AND(d>V_3 B_1,d<V_3 B_2),AND(d>V_4 B_1,d<V_4 B_2),AND(d>V_5 B_1,d<V_5 B_2),AND(d>V_6 B_1,d<V_6 B_2)),d,0)","v":0},{"$f":"IF(OR(AND(d>V_1 C_1,d<V_1 C_2),AND(d>V_2 C_1,d<V_2 C_2),AND(d>V_3 C_1,d<V_3 C_2),AND(d>V_4 C_1,d<V_4 C_2),AND(d>V_5 C_1,d<V_5 C_2),AND(d>V_6 C_1,d<V_6 C_2)),d,0)","v":42434},42434,42434]
[null,null,null,null,null,null,null,null,"2016-03-06",null,{"$f":"IF(OR(AND(d>V_1 A_1,d<V_1 A_2),AND(d>V_2 A_1,d<V_2 A_2),AND(d>V_3 A_1,d<V_3 A_2),AND(d>V_4 A_1,d<V_4 A_2),AND(d>V_5 A_1,d<V_5 A_2),AND(d>V_6 A_1,d<V_6 A_2)),d,0)","v":0},{"$f":"IF(OR(AND(d>V_1 B_1,d<V_1 B_2),AND(d>V_2 B_1,d<V_2 B_2),AND(d>V_3 B_1,d<V_3 B_2),AND(d>V_4 B_1,d<V_4 B_2),AND(d>V_5 B_1,d<V_5 B_2),AND(d>V_6 B_1,d<V_6 B_2)),d,0)","v":0},{"$f":"IF(OR(AND(d>V_1 C_1,d<V_1 C_2),AND(d>V_2 C_1,d<V_2 C_2),AND(d>V_3 C_1,d<V_3 C_2),AND(d>V_4 C_1,d<V_4 C_2),AND(d>V_5 C_1,d<V_5 C_2),AND(d>V_6 C_1,d<V_6 C_2)),d,0)","v":42435},42435,42435]
[null,null,null,null,null,null,null,null,"2016-03-07",null,{"$f":"IF(OR(AND(d>V_1 A_1,d<V_1 A_2),AND(d>V_2 A_1,d<V_2 A_2),AND(d>V_3 A_1,d<V_3 A_2),AND(d>V_4 A_1,d<V_4 A_2),AND(d>V_5 A_1,d<V_5 A_2),AND(d>V_6 A_1,d<V_6 A_2)),d,0)","v":0},{"$f":"IF(OR(AND(d>V_1 B_1,d<V_1 B_2),AND(d>V_2 B_1,d<V_2 B_2),AND(d>V_3 B_1,d<V_3 B_2),AND(d>V_4 B_1,d<V_4 B_2),AND(d>V_5 B_1,d<V_5 B_2),AND(d>V_6 B_1,d<V_6 B_2)),d,0)","v":0},{"$f":"IF(OR(AND(d>V_1 C_1,d<V_1 C_2),AND(d>V_2 C_1,d<V_2 C_2),AND(d>V_3 C_1,d<V_3 C_2),AND(d>V_4 C_1,d<V_4 C_2),AND(d>V_5 C_1,d<V_5 C_2),AND(d>V_6 C_1,d<V_6 C_2)),d,0)","v":0},0,0]
[null,null,null,null,null,null,null,null,"2016-03-08",null,{"$f":"IF(OR(AND(d>V_1 A_1,d<V_1 A_2),AND(d>V_2 A_1,d<V_2 A_2),AND(d>V_3 A_1,d<V_3 A_2),AND(d>V_4 A_1,d<V_4 A_2),AND(d>V_5 A_1,d<V_5 A_2),AND(d>V_6 A_1,d<V_6 A_2)),d,0)","v":0},{"$f":"IF(OR(AND(d>V_1 B_1,d<V_1 B_2),AND(d>V_2 B_1,d<V_2 B_2),AND(d>V_3 B_1,d<V_3 B_2),AND(d>V_4 B_1,d<V_4 B_2),AND(d>V_5 B_1,d<V_5 B_2),AND(d>V_6 B_1,d<V_6 B_2)),d,0)","v":0},{"$f":"IF(OR(AND(d>V_1 C_1,d<V_1 C_2),AND(d>V_2 C_1,d<V_2 C_2),AND(d>V_3 C_1,d<V_3 C_2),AND(d>V_4 C_1,d<V_4 C_2),AND(d>V_5 C_1,d<V_5 C_2),AND(d>V_6 C_1,d<V_6 C_2)),d,0)","v":0},0,0]
[null,null,null,null,null,null,null,null,"2016-03-09",null,{"$f":"IF(OR(AND(d>V_1 A_1,d<V_1 A_2),AND(d>V_2 A_1,d<V_2 A_2),AND(d>V_3 A_1,d<V_3 A_2),AND(d>V_4 A_1,d<V_4 A_2),AND(d>V_5 A_1,d<V_5 A_2),AND(d>V_6 A_1,d<V_6 A_2)),d,0)","v":0},{"$f":"IF(OR(AND(d>V_1 B_1,d<V_1 B_2),AND(d>V_2 B_1,d<V_2 B_2),AND(d>V_3 B_1,d<V_3 B_2),AND(d>V_4 B_1,d<V_4 B_2),AND(d>V_5 B_1,d<V_5 B_2),AND(d>V_6 B_1,d<V_6 B_2)),d,0)","v":0},{"$f":"IF(OR(AND(d>V_1 C_1,d<V_1 C_2),AND(d>V_2 C_1,d<V_2 C_2),AND(d>V_3 C_1,d<V_3 C_2),AND(d>V_4 C_1,d<V_4 C_2),AND(d>V_5 C_1,d<V_5 C_2),AND(d>V_6 C_1,d<V_6 C_2)),d,0)","v":0},0,0]
[null,null,null,null,null,null,null,null,"2016-03-10",null,{"$f":"IF(OR(AND(d>V_1 A_1,d<V_1 A_2),AND(d>V_2 A_1,d<V_2 A_2),AND(d>V_3 A_1,d<V_3 A_2),AND(d>V_4 A_1,d<V_4 A_2),AND(d>V_5 A_1,d<V_5 A_2),AND(d>V_6 A_1,d<V_6 A_2)),d,0)","v":0},{"$f":"IF(OR(AND(d>V_1 B_1,d<V_1 B_2),AND(d>V_2 B_1,d<V_2 B_2),AND(d>V_3 B_1,d<V_3 B_2),AND(d>V_4 B_1,d<V_4 B_2),AND(d>V_5 B_1,d<V_5 B_2),AND(d>V_6 B_1,d<V_6 B_2)),d,0)","v":0},{"$f":"IF(OR(AND(d>V_1 C_1,d<V_1 C_2),AND(d>V_2 C_1,d<V_2 C_2),AND(d>V_3 C_1,d<V_3 C_2),AND(d>V_4 C_1,d<V_4 C_2),AND(d>V_5 C_1,d<V_5 C_2),AND(d>V_6 C_1,d<V_6 C_2)),d,0)","v":0},0,0]
[null,null,null,null,null,null,null,null,"2016-03-11",null,{"$f":"IF(OR(AND(d>V_1 A_1,d<V_1 A_2),AND(d>V_2 A_1,d<V_2 A_2),AND(d>V_3 A_1,d<V_3 A_2),AND(d>V_4 A_1,d<V_4 A_2),AND(d>V_5 A_1,d<V_5 A_2),AND(d>V_6 A_1,d<V_6 A_2)),d,0)","v":0},{"$f":"IF(OR(AND(d>V_1 B_1,d<V_1 B_2),AND(d>V_2 B_1,d<V_2 B_2),AND(d>V_3 B_1,d<V_3 B_2),AND(d>V_4 B_1,d<V_4 B_2),AND(d>V_5 B_1,d<V_5 B_2),AND(d>V_6 B_1,d<V_6 B_2)),d,0)","v":0},{"$f":"IF(OR(AND(d>V_1 C_1,d<V_1 C_2),AND(d>V_2 C_1,d<V_2 C_2),AND(d>V_3 C_1,d<V_3 C_2),AND(d>V_4 C_1,d<V_4 C_2),AND(d>V_5 C_1,d<V_5 C_2),AND(d>V_6 C_1,d<V_6 C_2)),d,0)","v":0},0,0]
[null,null,null,null,null,null,null,null,"2016-03-12",null,{"$f":"IF(OR(AND(d>V_1 A_1,d<V_1 A_2),AND(d>V_2 A_1,d<V_2 A_2),AND(d>V_3 A_1,d<V_3 A_2),AND(d>V_4 A_1,d<V_4 A_2),AND(d>V_5 A_1,d<V_5 A_2),AND(d>V_6 A_1,d<V_6 A_2)),d,0)","v":0},{"$f":"IF(OR(AND(d>V_1 B_1,d<V_1 B_2),AND(d>V_2 B_1,d<V_2 B_2),AND(d>V_3 B_1,d<V_3 B_2),AND(d>V_4 B_1,d<V_4 B_2),AND(d>V_5 B_1,d<V_5 B_2),AND(d>V_6 B_1,d<V_6 B_2)),d,0)","v":0},{"$f":"IF(OR(AND(d>V_1 C_1,d<V_1 C_2),AND(d>V_2 C_1,d<V_2 C_2),AND(d>V_3 C_1,d<V_3 C_2),AND(d>V_4 C_1,d<V_4 C_2),AND(d>V_5 C_1,d<V_5 C_2),AND(d>V_6 C_1,d<V_6 C_2)),d,0)","v":0},0,0]
[null,null,null,null,null,null,null,null,"2016-03-13",null,{"$f":"IF(OR(AND(d>V_1 A_1,d<V_1 A_2),AND(d>V_2 A_1,d<V_2 A_2),AND(d>V_3 A_1,d<V_3 A_2),AND(d>V_4 A_1,d<V_4 A_2),AND(d>V_5 A_1,d<V_5 A_2),AND(d>V_6 A_1,d<V_6 A_2)),d,0)","v":0},{"$f":"IF(OR(AND(d>V_1 B_1,d<V_1 B_2),AND(d>V_2 B_1,d<V_2 B_2),AND(d>V_3 B_1,d<V_3 B_2),AND(d>V_4 B_1,d<V_4 B_2),AND(d>V_5 B_1,d<V_5 B_2),AND(d>V_6 B_1,d<V_6 B_2)),d,0)","v":0},{"$f":"IF(OR(AND(d>V_1 C_1,d<V_1 C_2),AND(d>V_2 C_1,d<V_2 C_2),AND(d>V_3 C_1,d<V_3 C_2),AND(d>V_4 C_1,d<V_4 C_2),AND(d>V_5 C_1,d<V_5 C_2),AND(d>V_6 C_1,d<V_6 C_2)),d,0)","v":0},0,0]
[null,null,null,null,null,null,null,null,"2016-03-14",null,{"$f":"IF(OR(AND(d>V_1 A_1,d<V_1 A_2),AND(d>V_2 A_1,d<V_2 A_2),AND(d>V_3 A_1,d<V_3 A_2),AND(d>V_4 A_1,d<V_4 A_2),AND(d>V_5 A_1,d<V_5 A_2),AND(d>V_6 A_1,d<V_6 A_2)),d,0)","v":0},{"$f":"IF(OR(AND(d>V_1 B_1,d<V_1 B_2),AND(d>V_2 B_1,d<V_2 B_2),AND(d>V_3 B_1,d<V_3 B_2),AND(d>V_4 B_1,d<V_4 B_2),AND(d>V_5 B_1,d<V_5 B_2),AND(d>V_6 B_1,d<V_6 B_2)),d,0)","v":0},{"$f":"IF(OR(AND(d>V_1 C_1,d<V_1 C_2),AND(d>V_2 C_1,d<V_2 C_2),AND(d>V_3 C_1,d<V_3 C_2),AND(d>V_4 C_1,d<V_4 C_2),AND(d>V_5 C_1,d<V_5 C_2),AND(d>V_6 C_1,d<V_6 C_2)),d,0)","v":0},0,0]
[null,null,null,null,null,null,null,null,"2016-03-15",null,{"$f":"IF(OR(AND(d>V_1 A_1,d<V_1 A_2),AND(d>V_2 A_1,d<V_2 A_2),AND(d>V_3 A_1,d<V_3 A_2),AND(d>V_4 A_1,d<V_4 A_2),AND(d>V_5 A_1,d<V_5 A_2),AND(d>V_6 A_1,d<V_6 A_2)),d,0)","v":0},{"$f":"IF(OR(AND(d>V_1 B_1,d<V_1 B_2),AND(d>V_2 B_1,d<V_2 B_2),AND(d>V_3 B_1,d<V_3 B_2),AND(d>V_4 B_1,d<V_4 B_2),AND(d>V_5 B_1,d<V_5 B_2),AND(d>V_6 B_1,d<V_6 B_2)),d,0)","v":0},{"$f":"IF(OR(AND(d>V_1 C_1,d<V_1 C_2),AND(d>V_2 C_1,d<V_2 C_2),AND(d>V_3 C_1,d<V_3 C_2),AND(d>V_4 C_1,d<V_4 C_2),AND(d>V_5 C_1,d<V_5 C_2),AND(d>V_6 C_1,d<V_6 C_2)),d,0)","v":0},0,0]
[null,null,null,null,null,null,null,null,"2016-03-16",null,{"$f":"IF(OR(AND(d>V_1 A_1,d<V_1 A_2),AND(d>V_2 A_1,d<V_2 A_2),AND(d>V_3 A_1,d<V_3 A_2),AND(d>V_4 A_1,d<V_4 A_2),AND(d>V_5 A_1,d<V_5 A_2),AND(d>V_6 A_1,d<V_6 A_2)),d,0)","v":0},{"$f":"IF(OR(AND(d>V_1 B_1,d<V_1 B_2),AND(d>V_2 B_1,d<V_2 B_2),AND(d>V_3 B_1,d<V_3 B_2),AND(d>V_4 B_1,d<V_4 B_2),AND(d>V_5 B_1,d<V_5 B_2),AND(d>V_6 B_1,d<V_6 B_2)),d,0)","v":0},{"$f":"IF(OR(AND(d>V_1 C_1,d<V_1 C_2),AND(d>V_2 C_1,d<V_2 C_2),AND(d>V_3 C_1,d<V_3 C_2),AND(d>V_4 C_1,d<V_4 C_2),AND(d>V_5 C_1,d<V_5 C_2),AND(d>V_6 C_1,d<V_6 C_2)),d,0)","v":0},0,{"$f":"INDEX(J266:N266,choix_zone)","v":0}]
[null,null,null,null,null,null,null,null,"2016-03-17",null,{"$f":"IF(OR(AND(d>V_1 A_1,d<V_1 A_2),AND(d>V_2 A_1,d<V_2 A_2),AND(d>V_3 A_1,d<V_3 A_2),AND(d>V_4 A_1,d<V_4 A_2),AND(d>V_5 A_1,d<V_5 A_2),AND(d>V_6 A_1,d<V_6 A_2)),d,0)","v":0},{"$f":"IF(OR(AND(d>V_1 B_1,d<V_1 B_2),AND(d>V_2 B_1,d<V_2 B_2),AND(d>V_3 B_1,d<V_3 B_2),AND(d>V_4 B_1,d<V_4 B_2),AND(d>V_5 B_1,d<V_5 B_2),AND(d>V_6 B_1,d<V_6 B_2)),d,0)","v":0},{"$f":"IF(OR(AND(d>V_1 C_1,d<V_1 C_2),AND(d>V_2 C_1,d<V_2 C_2),AND(d>V_3 C_1,d<V_3 C_2),AND(d>V_4 C_1,d<V_4 C_2),AND(d>V_5 C_1,d<V_5 C_2),AND(d>V_6 C_1,d<V_6 C_2)),d,0)","v":0},{"$f":"MAX(K267:M267)","v":0},0]
[null,null,null,null,null,null,null,null,{"$f":"I267+1","v":"2016-03-18"},null,{"$f":"IF(OR(AND(d>V_1 A_1,d<V_1 A_2),AND(d>V_2 A_1,d<V_2 A_2),AND(d>V_3 A_1,d<V_3 A_2),AND(d>V_4 A_1,d<V_4 A_2),AND(d>V_5 A_1,d<V_5 A_2),AND(d>V_6 A_1,d<V_6 A_2)),d,0)","v":0},{"$f":"IF(OR(AND(d>V_1 B_1,d<V_1 B_2),AND(d>V_2 B_1,d<V_2 B_2),AND(d>V_3 B_1,d<V_3 B_2),AND(d>V_4 B_1,d<V_4 B_2),AND(d>V_5 B_1,d<V_5 B_2),AND(d>V_6 B_1,d<V_6 B_2)),d,0)","v":0},{"$f":"IF(OR(AND(d>V_1 C_1,d<V_1 C_2),AND(d>V_2 C_1,d<V_2 C_2),AND(d>V_3 C_1,d<V_3 C_2),AND(d>V_4 C_1,d<V_4 C_2),AND(d>V_5 C_1,d<V_5 C_2),AND(d>V_6 C_1,d<V_6 C_2)),d,0)","v":0},0,0]
[null,null,null,null,null,null,null,null,"2016-03-19",null,{"$f":"IF(OR(AND(d>V_1 A_1,d<V_1 A_2),AND(d>V_2 A_1,d<V_2 A_2),AND(d>V_3 A_1,d<V_3 A_2),AND(d>V_4 A_1,d<V_4 A_2),AND(d>V_5 A_1,d<V_5 A_2),AND(d>V_6 A_1,d<V_6 A_2)),d,0)","v":0},{"$f":"IF(OR(AND(d>V_1 B_1,d<V_1 B_2),AND(d>V_2 B_1,d<V_2 B_2),AND(d>V_3 B_1,d<V_3 B_2),AND(d>V_4 B_1,d<V_4 B_2),AND(d>V_5 B_1,d<V_5 B_2),AND(d>V_6 B_1,d<V_6 B_2)),d,0)","v":0},{"$f":"IF(OR(AND(d>V_1 C_1,d<V_1 C_2),AND(d>V_2 C_1,d<V_2 C_2),AND(d>V_3 C_1,d<V_3 C_2),AND(d>V_4 C_1,d<V_4 C_2),AND(d>V_5 C_1,d<V_5 C_2),AND(d>V_6 C_1,d<V_6 C_2)),d,0)","v":0},0,0]
[null,null,null,null,null,null,null,null,"2016-03-20",null,{"$f":"IF(OR(AND(d>V_1 A_1,d<V_1 A_2),AND(d>V_2 A_1,d<V_2 A_2),AND(d>V_3 A_1,d<V_3 A_2),AND(d>V_4 A_1,d<V_4 A_2),AND(d>V_5 A_1,d<V_5 A_2),AND(d>V_6 A_1,d<V_6 A_2)),d,0)","v":0},{"$f":"IF(OR(AND(d>V_1 B_1,d<V_1 B_2),AND(d>V_2 B_1,d<V_2 B_2),AND(d>V_3 B_1,d<V_3 B_2),AND(d>V_4 B_1,d<V_4 B_2),AND(d>V_5 B_1,d<V_5 B_2),AND(d>V_6 B_1,d<V_6 B_2)),d,0)","v":0},{"$f":"IF(OR(AND(d>V_1 C_1,d<V_1 C_2),AND(d>V_2 C_1,d<V_2 C_2),AND(d>V_3 C_1,d<V_3 C_2),AND(d>V_4 C_1,d<V_4 C_2),AND(d>V_5 C_1,d<V_5 C_2),AND(d>V_6 C_1,d<V_6 C_2)),d,0)","v":0},0,0]
[null,null,null,null,null,null,null,null,"2016-03-21",null,{"$f":"IF(OR(AND(d>V_1 A_1,d<V_1 A_2),AND(d>V_2 A_1,d<V_2 A_2),AND(d>V_3 A_1,d<V_3 A_2),AND(d>V_4 A_1,d<V_4 A_2),AND(d>V_5 A_1,d<V_5 A_2),AND(d>V_6 A_1,d<V_6 A_2)),d,0)","v":0},{"$f":"IF(OR(AND(d>V_1 B_1,d<V_1 B_2),AND(d>V_2 B_1,d<V_2 B_2),AND(d>V_3 B_1,d<V_3 B_2),AND(d>V_4 B_1,d<V_4 B_2),AND(d>V_5 B_1,d<V_5 B_2),AND(d>V_6 B_1,d<V_6 B_2)),d,0)","v":0},{"$f":"IF(OR(AND(d>V_1 C_1,d<V_1 C_2),AND(d>V_2 C_1,d<V_2 C_2),AND(d>V_3 C_1,d<V_3 C_2),AND(d>V_4 C_1,d<V_4 C_2),AND(d>V_5 C_1,d<V_5 C_2),AND(d>V_6 C_1,d<V_6 C_2)),d,0)","v":0},0,0]
[null,null,null,null,null,null,null,null,"2016-03-22",null,{"$f":"IF(OR(AND(d>V_1 A_1,d<V_1 A_2),AND(d>V_2 A_1,d<V_2 A_2),AND(d>V_3 A_1,d<V_3 A_2),AND(d>V_4 A_1,d<V_4 A_2),AND(d>V_5 A_1,d<V_5 A_2),AND(d>V_6 A_1,d<V_6 A_2)),d,0)","v":0},{"$f":"IF(OR(AND(d>V_1 B_1,d<V_1 B_2),AND(d>V_2 B_1,d<V_2 B_2),AND(d>V_3 B_1,d<V_3 B_2),AND(d>V_4 B_1,d<V_4 B_2),AND(d>V_5 B_1,d<V_5 B_2),AND(d>V_6 B_1,d<V_6 B_2)),d,0)","v":0},{"$f":"IF(OR(AND(d>V_1 C_1,d<V_1 C_2),AND(d>V_2 C_1,d<V_2 C_2),AND(d>V_3 C_1,d<V_3 C_2),AND(d>V_4 C_1,d<V_4 C_2),AND(d>V_5 C_1,d<V_5 C_2),AND(d>V_6 C_1,d<V_6 C_2)),d,0)","v":0},0,0]
[null,null,null,null,null,null,null,null,"2016-03-23",null,{"$f":"IF(OR(AND(d>V_1 A_1,d<V_1 A_2),AND(d>V_2 A_1,d<V_2 A_2),AND(d>V_3 A_1,d<V_3 A_2),AND(d>V_4 A_1,d<V_4 A_2),AND(d>V_5 A_1,d<V_5 A_2),AND(d>V_6 A_1,d<V_6 A_2)),d,0)","v":0},{"$f":"IF(OR(AND(d>V_1 B_1,d<V_1 B_2),AND(d>V_2 B_1,d<V_2 B_2),AND(d>V_3 B_1,d<V_3 B_2),AND(d>V_4 B_1,d<V_4 B_2),AND(d>V_5 B_1,d<V_5 B_2),AND(d>V_6 B_1,d<V_6 B_2)),d,0)","v":0},{"$f":"IF(OR(AND(d>V_1 C_1,d<V_1 C_2),AND(d>V_2 C_1,d<V_2 C_2),AND(d>V_3 C_1,d<V_3 C_2),AND(d>V_4 C_1,d<V_4 C_2),AND(d>V_5 C_1,d<V_5 C_2),AND(d>V_6 C_1,d<V_6 C_2)),d,0)","v":0},0,0]
[null,null,null,null,null,null,null,null,"2016-03-24",null,{"$f":"IF(OR(AND(d>V_1 A_1,d<V_1 A_2),AND(d>V_2 A_1,d<V_2 A_2),AND(d>V_3 A_1,d<V_3 A_2),AND(d>V_4 A_1,d<V_4 A_2),AND(d>V_5 A_1,d<V_5 A_2),AND(d>V_6 A_1,d<V_6 A_2)),d,0)","v":0},{"$f":"IF(OR(AND(d>V_1 B_1,d<V_1 B_2),AND(d>V_2 B_1,d<V_2 B_2),AND(d>V_3 B_1,d<V_3 B_2),AND(d>V_4 B_1,d<V_4 B_2),AND(d>V_5 B_1,d<V_5 B_2),AND(d>V_6 B_1,d<V_6 B_2)),d,0)","v":0},{"$f":"IF(OR(AND(d>V_1 C_1,d<V_1 C_2),AND(d>V_2 C_1,d<V_2 C_2),AND(d>V_3 C_1,d<V_3 C_2),AND(d>V_4 C_1,d<V_4 C_2),AND(d>V_5 C_1,d<V_5 C_2),AND(d>V_6 C_1,d<V_6 C_2)),d,0)","v":0},0,0]
[null,null,null,null,null,null,null,null,"2016-03-25",null,{"$f":"IF(OR(AND(d>V_1 A_1,d<V_1 A_2),AND(d>V_2 A_1,d<V_2 A_2),AND(d>V_3 A_1,d<V_3 A_2),AND(d>V_4 A_1,d<V_4 A_2),AND(d>V_5 A_1,d<V_5 A_2),AND(d>V_6 A_1,d<V_6 A_2)),d,0)","v":0},{"$f":"IF(OR(AND(d>V_1 B_1,d<V_1 B_2),AND(d>V_2 B_1,d<V_2 B_2),AND(d>V_3 B_1,d<V_3 B_2),AND(d>V_4 B_1,d<V_4 B_2),AND(d>V_5 B_1,d<V_5 B_2),AND(d>V_6 B_1,d<V_6 B_2)),d,0)","v":0},{"$f":"IF(OR(AND(d>V_1 C_1,d<V_1 C_2),AND(d>V_2 C_1,d<V_2 C_2),AND(d>V_3 C_1,d<V_3 C_2),AND(d>V_4 C_1,d<V_4 C_2),AND(d>V_5 C_1,d<V_5 C_2),AND(d>V_6 C_1,d<V_6 C_2)),d,0)","v":0},0,0]
[null,null,null,null,null,null,null,null,"2016-03-26",null,{"$f":"IF(OR(AND(d>V_1 A_1,d<V_1 A_2),AND(d>V_2 A_1,d<V_2 A_2),AND(d>V_3 A_1,d<V_3 A_2),AND(d>V_4 A_1,d<V_4 A_2),AND(d>V_5 A_1,d<V_5 A_2),AND(d>V_6 A_1,d<V_6 A_2)),d,0)","v":0},{"$f":"IF(OR(AND(d>V_1 B_1,d<V_1 B_2),AND(d>V_2 B_1,d<V_2 B_2),AND(d>V_3 B_1,d<V_3 B_2),AND(d>V_4 B_1,d<V_4 B_2),AND(d>V_5 B_1,d<V_5 B_2),AND(d>V_6 B_1,d<V_6 B_2)),d,0)","v":0},{"$f":"IF(OR(AND(d>V_1 C_1,d<V_1 C_2),AND(d>V_2 C_1,d<V_2 C_2),AND(d>V_3 C_1,d<V_3 C_2),AND(d>V_4 C_1,d<V_4 C_2),AND(d>V_5 C_1,d<V_5 C_2),AND(d>V_6 C_1,d<V_6 C_2)),d,0)","v":0},0,0]
[null,null,null,null,null,null,null,null,"2016-03-27",null,{"$f":"IF(OR(AND(d>V_1 A_1,d<V_1 A_2),AND(d>V_2 A_1,d<V_2 A_2),AND(d>V_3 A_1,d<V_3 A_2),AND(d>V_4 A_1,d<V_4 A_2),AND(d>V_5 A_1,d<V_5 A_2),AND(d>V_6 A_1,d<V_6 A_2)),d,0)","v":0},{"$f":"IF(OR(AND(d>V_1 B_1,d<V_1 B_2),AND(d>V_2 B_1,d<V_2 B_2),AND(d>V_3 B_1,d<V_3 B_2),AND(d>V_4 B_1,d<V_4 B_2),AND(d>V_5 B_1,d<V_5 B_2),AND(d>V_6 B_1,d<V_6 B_2)),d,0)","v":0},{"$f":"IF(OR(AND(d>V_1 C_1,d<V_1 C_2),AND(d>V_2 C_1,d<V_2 C_2),AND(d>V_3 C_1,d<V_3 C_2),AND(d>V_4 C_1,d<V_4 C_2),AND(d>V_5 C_1,d<V_5 C_2),AND(d>V_6 C_1,d<V_6 C_2)),d,0)","v":0},0,0]
[null,null,null,null,null,null,null,null,"2016-03-28",null,{"$f":"IF(OR(AND(d>V_1 A_1,d<V_1 A_2),AND(d>V_2 A_1,d<V_2 A_2),AND(d>V_3 A_1,d<V_3 A_2),AND(d>V_4 A_1,d<V_4 A_2),AND(d>V_5 A_1,d<V_5 A_2),AND(d>V_6 A_1,d<V_6 A_2)),d,0)","v":0},{"$f":"IF(OR(AND(d>V_1 B_1,d<V_1 B_2),AND(d>V_2 B_1,d<V_2 B_2),AND(d>V_3 B_1,d<V_3 B_2),AND(d>V_4 B_1,d<V_4 B_2),AND(d>V_5 B_1,d<V_5 B_2),AND(d>V_6 B_1,d<V_6 B_2)),d,0)","v":0},{"$f":"IF(OR(AND(d>V_1 C_1,d<V_1 C_2),AND(d>V_2 C_1,d<V_2 C_2),AND(d>V_3 C_1,d<V_3 C_2),AND(d>V_4 C_1,d<V_4 C_2),AND(d>V_5 C_1,d<V_5 C_2),AND(d>V_6 C_1,d<V_6 C_2)),d,0)","v":0},0,0]
[null,null,null,null,null,null,null,null,"2016-03-29",null,{"$f":"IF(OR(AND(d>V_1 A_1,d<V_1 A_2),AND(d>V_2 A_1,d<V_2 A_2),AND(d>V_3 A_1,d<V_3 A_2),AND(d>V_4 A_1,d<V_4 A_2),AND(d>V_5 A_1,d<V_5 A_2),AND(d>V_6 A_1,d<V_6 A_2)),d,0)","v":0},{"$f":"IF(OR(AND(d>V_1 B_1,d<V_1 B_2),AND(d>V_2 B_1,d<V_2 B_2),AND(d>V_3 B_1,d<V_3 B_2),AND(d>V_4 B_1,d<V_4 B_2),AND(d>V_5 B_1,d<V_5 B_2),AND(d>V_6 B_1,d<V_6 B_2)),d,0)","v":0},{"$f":"IF(OR(AND(d>V_1 C_1,d<V_1 C_2),AND(d>V_2 C_1,d<V_2 C_2),AND(d>V_3 C_1,d<V_3 C_2),AND(d>V_4 C_1,d<V_4 C_2),AND(d>V_5 C_1,d<V_5 C_2),AND(d>V_6 C_1,d<V_6 C_2)),d,0)","v":0},0,0]
[null,null,null,null,null,null,null,null,"2016-03-30",null,{"$f":"IF(OR(AND(d>V_1 A_1,d<V_1 A_2),AND(d>V_2 A_1,d<V_2 A_2),AND(d>V_3 A_1,d<V_3 A_2),AND(d>V_4 A_1,d<V_4 A_2),AND(d>V_5 A_1,d<V_5 A_2),AND(d>V_6 A_1,d<V_6 A_2)),d,0)","v":0},{"$f":"IF(OR(AND(d>V_1 B_1,d<V_1 B_2),AND(d>V_2 B_1,d<V_2 B_2),AND(d>V_3 B_1,d<V_3 B_2),AND(d>V_4 B_1,d<V_4 B_2),AND(d>V_5 B_1,d<V_5 B_2),AND(d>V_6 B_1,d<V_6 B_2)),d,0)","v":0},{"$f":"IF(OR(AND(d>V_1 C_1,d<V_1 C_2),AND(d>V_2 C_1,d<V_2 C_2),AND(d>V_3 C_1,d<V_3 C_2),AND(d>V_4 C_1,d<V_4 C_2),AND(d>V_5 C_1,d<V_5 C_2),AND(d>V_6 C_1,d<V_6 C_2)),d,0)","v":0},0,0]
[null,null,null,null,null,null,null,null,"2016-03-31",null,{"$f":"IF(OR(AND(d>V_1 A_1,d<V_1 A_2),AND(d>V_2 A_1,d<V_2 A_2),AND(d>V_3 A_1,d<V_3 A_2),AND(d>V_4 A_1,d<V_4 A_2),AND(d>V_5 A_1,d<V_5 A_2),AND(d>V_6 A_1,d<V_6 A_2)),d,0)","v":0},{"$f":"IF(OR(AND(d>V_1 B_1,d<V_1 B_2),AND(d>V_2 B_1,d<V_2 B_2),AND(d>V_3 B_1,d<V_3 B_2),AND(d>V_4 B_1,d<V_4 B_2),AND(d>V_5 B_1,d<V_5 B_2),AND(d>V_6 B_1,d<V_6 B_2)),d,0)","v":0},{"$f":"IF(OR(AND(d>V_1 C_1,d<V_1 C_2),AND(d>V_2 C_1,d<V_2 C_2),AND(d>V_3 C_1,d<V_3 C_2),AND(d>V_4 C_1,d<V_4 C_2),AND(d>V_5 C_1,d<V_5 C_2),AND(d>V_6 C_1,d<V_6 C_2)),d,0)","v":0},0,0]
[null,null,null,null,null,null,null,null,"2016-04-01",null,{"$f":"IF(OR(AND(d>V_1 A_1,d<V_1 A_2),AND(d>V_2 A_1,d<V_2 A_2),AND(d>V_3 A_1,d<V_3 A_2),AND(d>V_4 A_1,d<V_4 A_2),AND(d>V_5 A_1,d<V_5 A_2),AND(d>V_6 A_1,d<V_6 A_2)),d,0)","v":0},{"$f":"IF(OR(AND(d>V_1 B_1,d<V_1 B_2),AND(d>V_2 B_1,d<V_2 B_2),AND(d>V_3 B_1,d<V_3 B_2),AND(d>V_4 B_1,d<V_4 B_2),AND(d>V_5 B_1,d<V_5 B_2),AND(d>V_6 B_1,d<V_6 B_2)),d,0)","v":0},{"$f":"IF(OR(AND(d>V_1 C_1,d<V_1 C_2),AND(d>V_2 C_1,d<V_2 C_2),AND(d>V_3 C_1,d<V_3 C_2),AND(d>V_4 C_1,d<V_4 C_2),AND(d>V_5 C_1,d<V_5 C_2),AND(d>V_6 C_1,d<V_6 C_2)),d,0)","v":0},0,0]
[null,null,null,null,null,null,null,null,"2016-04-02",null,{"$f":"IF(OR(AND(d>V_1 A_1,d<V_1 A_2),AND(d>V_2 A_1,d<V_2 A_2),AND(d>V_3 A_1,d<V_3 A_2),AND(d>V_4 A_1,d<V_4 A_2),AND(d>V_5 A_1,d<V_5 A_2),AND(d>V_6 A_1,d<V_6 A_2)),d,0)","v":0},{"$f":"IF(OR(AND(d>V_1 B_1,d<V_1 B_2),AND(d>V_2 B_1,d<V_2 B_2),AND(d>V_3 B_1,d<V_3 B_2),AND(d>V_4 B_1,d<V_4 B_2),AND(d>V_5 B_1,d<V_5 B_2),AND(d>V_6 B_1,d<V_6 B_2)),d,0)","v":0},{"$f":"IF(OR(AND(d>V_1 C_1,d<V_1 C_2),AND(d>V_2 C_1,d<V_2 C_2),AND(d>V_3 C_1,d<V_3 C_2),AND(d>V_4 C_1,d<V_4 C_2),AND(d>V_5 C_1,d<V_5 C_2),AND(d>V_6 C_1,d<V_6 C_2)),d,0)","v":0},0,0]
[null,null,null,null,null,null,null,null,"2016-04-03",null,{"$f":"IF(OR(AND(d>V_1 A_1,d<V_1 A_2),AND(d>V_2 A_1,d<V_2 A_2),AND(d>V_3 A_1,d<V_3 A_2),AND(d>V_4 A_1,d<V_4 A_2),AND(d>V_5 A_1,d<V_5 A_2),AND(d>V_6 A_1,d<V_6 A_2)),d,0)","v":0},{"$f":"IF(OR(AND(d>V_1 B_1,d<V_1 B_2),AND(d>V_2 B_1,d<V_2 B_2),AND(d>V_3 B_1,d<V_3 B_2),AND(d>V_4 B_1,d<V_4 B_2),AND(d>V_5 B_1,d<V_5 B_2),AND(d>V_6 B_1,d<V_6 B_2)),d,0)","v":42463},{"$f":"IF(OR(AND(d>V_1 C_1,d<V_1 C_2),AND(d>V_2 C_1,d<V_2 C_2),AND(d>V_3 C_1,d<V_3 C_2),AND(d>V_4 C_1,d<V_4 C_2),AND(d>V_5 C_1,d<V_5 C_2),AND(d>V_6 C_1,d<V_6 C_2)),d,0)","v":0},42463,0]
[null,null,null,null,null,null,null,null,"2016-04-04",null,{"$f":"IF(OR(AND(d>V_1 A_1,d<V_1 A_2),AND(d>V_2 A_1,d<V_2 A_2),AND(d>V_3 A_1,d<V_3 A_2),AND(d>V_4 A_1,d<V_4 A_2),AND(d>V_5 A_1,d<V_5 A_2),AND(d>V_6 A_1,d<V_6 A_2)),d,0)","v":0},{"$f":"IF(OR(AND(d>V_1 B_1,d<V_1 B_2),AND(d>V_2 B_1,d<V_2 B_2),AND(d>V_3 B_1,d<V_3 B_2),AND(d>V_4 B_1,d<V_4 B_2),AND(d>V_5 B_1,d<V_5 B_2),AND(d>V_6 B_1,d<V_6 B_2)),d,0)","v":42464},{"$f":"IF(OR(AND(d>V_1 C_1,d<V_1 C_2),AND(d>V_2 C_1,d<V_2 C_2),AND(d>V_3 C_1,d<V_3 C_2),AND(d>V_4 C_1,d<V_4 C_2),AND(d>V_5 C_1,d<V_5 C_2),AND(d>V_6 C_1,d<V_6 C_2)),d,0)","v":0},42464,0]
[null,null,null,null,null,null,null,null,"2016-04-05",null,{"$f":"IF(OR(AND(d>V_1 A_1,d<V_1 A_2),AND(d>V_2 A_1,d<V_2 A_2),AND(d>V_3 A_1,d<V_3 A_2),AND(d>V_4 A_1,d<V_4 A_2),AND(d>V_5 A_1,d<V_5 A_2),AND(d>V_6 A_1,d<V_6 A_2)),d,0)","v":0},{"$f":"IF(OR(AND(d>V_1 B_1,d<V_1 B_2),AND(d>V_2 B_1,d<V_2 B_2),AND(d>V_3 B_1,d<V_3 B_2),AND(d>V_4 B_1,d<V_4 B_2),AND(d>V_5 B_1,d<V_5 B_2),AND(d>V_6 B_1,d<V_6 B_2)),d,0)","v":42465},{"$f":"IF(OR(AND(d>V_1 C_1,d<V_1 C_2),AND(d>V_2 C_1,d<V_2 C_2),AND(d>V_3 C_1,d<V_3 C_2),AND(d>V_4 C_1,d<V_4 C_2),AND(d>V_5 C_1,d<V_5 C_2),AND(d>V_6 C_1,d<V_6 C_2)),d,0)","v":0},42465,0]
[null,null,null,null,null,null,null,null,"2016-04-06",null,{"$f":"IF(OR(AND(d>V_1 A_1,d<V_1 A_2),AND(d>V_2 A_1,d<V_2 A_2),AND(d>V_3 A_1,d<V_3 A_2),AND(d>V_4 A_1,d<V_4 A_2),AND(d>V_5 A_1,d<V_5 A_2),AND(d>V_6 A_1,d<V_6 A_2)),d,0)","v":0},{"$f":"IF(OR(AND(d>V_1 B_1,d<V_1 B_2),AND(d>V_2 B_1,d<V_2 B_2),AND(d>V_3 B_1,d<V_3 B_2),AND(d>V_4 B_1,d<V_4 B_2),AND(d>V_5 B_1,d<V_5 B_2),AND(d>V_6 B_1,d<V_6 B_2)),d,0)","v":42466},{"$f":"IF(OR(AND(d>V_1 C_1,d<V_1 C_2),AND(d>V_2 C_1,d<V_2 C_2),AND(d>V_3 C_1,d<V_3 C_2),AND(d>V_4 C_1,d<V_4 C_2),AND(d>V_5 C_1,d<V_5 C_2),AND(d>V_6 C_1,d<V_6 C_2)),d,0)","v":0},42466,0]
[null,null,null,null,null,null,null,null,"2016-04-07",null,{"$f":"IF(OR(AND(d>V_1 A_1,d<V_1 A_2),AND(d>V_2 A_1,d<V_2 A_2),AND(d>V_3 A_1,d<V_3 A_2),AND(d>V_4 A_1,d<V_4 A_2),AND(d>V_5 A_1,d<V_5 A_2),AND(d>V_6 A_1,d<V_6 A_2)),d,0)","v":0},{"$f":"IF(OR(AND(d>V_1 B_1,d<V_1 B_2),AND(d>V_2 B_1,d<V_2 B_2),AND(d>V_3 B_1,d<V_3 B_2),AND(d>V_4 B_1,d<V_4 B_2),AND(d>V_5 B_1,d<V_5 B_2),AND(d>V_6 B_1,d<V_6 B_2)),d,0)","v":42467},{"$f":"IF(OR(AND(d>V_1 C_1,d<V_1 C_2),AND(d>V_2 C_1,d<V_2 C_2),AND(d>V_3 C_1,d<V_3 C_2),AND(d>V_4 C_1,d<V_4 C_2),AND(d>V_5 C_1,d<V_5 C_2),AND(d>V_6 C_1,d<V_6 C_2)),d,0)","v":0},42467,0]
[null,null,null,null,null,null,null,null,"2016-04-08",null,{"$f":"IF(OR(AND(d>V_1 A_1,d<V_1 A_2),AND(d>V_2 A_1,d<V_2 A_2),AND(d>V_3 A_1,d<V_3 A_2),AND(d>V_4 A_1,d<V_4 A_2),AND(d>V_5 A_1,d<V_5 A_2),AND(d>V_6 A_1,d<V_6 A_2)),d,0)","v":0},{"$f":"IF(OR(AND(d>V_1 B_1,d<V_1 B_2),AND(d>V_2 B_1,d<V_2 B_2),AND(d>V_3 B_1,d<V_3 B_2),AND(d>V_4 B_1,d<V_4 B_2),AND(d>V_5 B_1,d<V_5 B_2),AND(d>V_6 B_1,d<V_6 B_2)),d,0)","v":42468},{"$f":"IF(OR(AND(d>V_1 C_1,d<V_1 C_2),AND(d>V_2 C_1,d<V_2 C_2),AND(d>V_3 C_1,d<V_3 C_2),AND(d>V_4 C_1,d<V_4 C_2),AND(d>V_5 C_1,d<V_5 C_2),AND(d>V_6 C_1,d<V_6 C_2)),d,0)","v":0},42468,0]
[null,null,null,null,null,null,null,null,"2016-04-09",null,{"$f":"IF(OR(AND(d>V_1 A_1,d<V_1 A_2),AND(d>V_2 A_1,d<V_2 A_2),AND(d>V_3 A_1,d<V_3 A_2),AND(d>V_4 A_1,d<V_4 A_2),AND(d>V_5 A_1,d<V_5 A_2),AND(d>V_6 A_1,d<V_6 A_2)),d,0)","v":0},{"$f":"IF(OR(AND(d>V_1 B_1,d<V_1 B_2),AND(d>V_2 B_1,d<V_2 B_2),AND(d>V_3 B_1,d<V_3 B_2),AND(d>V_4 B_1,d<V_4 B_2),AND(d>V_5 B_1,d<V_5 B_2),AND(d>V_6 B_1,d<V_6 B_2)),d,0)","v":42469},{"$f":"IF(OR(AND(d>V_1 C_1,d<V_1 C_2),AND(d>V_2 C_1,d<V_2 C_2),AND(d>V_3 C_1,d<V_3 C_2),AND(d>V_4 C_1,d<V_4 C_2),AND(d>V_5 C_1,d<V_5 C_2),AND(d>V_6 C_1,d<V_6 C_2)),d,0)","v":0},42469,0]
[null,null,null,null,null,null,null,null,"2016-04-10",null,{"$f":"IF(OR(AND(d>V_1 A_1,d<V_1 A_2),AND(d>V_2 A_1,d<V_2 A_2),AND(d>V_3 A_1,d<V_3 A_2),AND(d>V_4 A_1,d<V_4 A_2),AND(d>V_5 A_1,d<V_5 A_2),AND(d>V_6 A_1,d<V_6 A_2)),d,0)","v":42470},{"$f":"IF(OR(AND(d>V_1 B_1,d<V_1 B_2),AND(d>V_2 B_1,d<V_2 B_2),AND(d>V_3 B_1,d<V_3 B_2),AND(d>V_4 B_1,d<V_4 B_2),AND(d>V_5 B_1,d<V_5 B_2),AND(d>V_6 B_1,d<V_6 B_2)),d,0)","v":42470},{"$f":"IF(OR(AND(d>V_1 C_1,d<V_1 C_2),AND(d>V_2 C_1,d<V_2 C_2),AND(d>V_3 C_1,d<V_3 C_2),AND(d>V_4 C_1,d<V_4 C_2),AND(d>V_5 C_1,d<V_5 C_2),AND(d>V_6 C_1,d<V_6 C_2)),d,0)","v":0},42470,0]
[null,null,null,null,null,null,null,null,"2016-04-11",null,{"$f":"IF(OR(AND(d>V_1 A_1,d<V_1 A_2),AND(d>V_2 A_1,d<V_2 A_2),AND(d>V_3 A_1,d<V_3 A_2),AND(d>V_4 A_1,d<V_4 A_2),AND(d>V_5 A_1,d<V_5 A_2),AND(d>V_6 A_1,d<V_6 A_2)),d,0)","v":42471},{"$f":"IF(OR(AND(d>V_1 B_1,d<V_1 B_2),AND(d>V_2 B_1,d<V_2 B_2),AND(d>V_3 B_1,d<V_3 B_2),AND(d>V_4 B_1,d<V_4 B_2),AND(d>V_5 B_1,d<V_5 B_2),AND(d>V_6 B_1,d<V_6 B_2)),d,0)","v":42471},{"$f":"IF(OR(AND(d>V_1 C_1,d<V_1 C_2),AND(d>V_2 C_1,d<V_2 C_2),AND(d>V_3 C_1,d<V_3 C_2),AND(d>V_4 C_1,d<V_4 C_2),AND(d>V_5 C_1,d<V_5 C_2),AND(d>V_6 C_1,d<V_6 C_2)),d,0)","v":0},42471,0]
[null,null,null,null,null,null,null,null,"2016-04-12",null,{"$f":"IF(OR(AND(d>V_1 A_1,d<V_1 A_2),AND(d>V_2 A_1,d<V_2 A_2),AND(d>V_3 A_1,d<V_3 A_2),AND(d>V_4 A_1,d<V_4 A_2),AND(d>V_5 A_1,d<V_5 A_2),AND(d>V_6 A_1,d<V_6 A_2)),d,0)","v":42472},{"$f":"IF(OR(AND(d>V_1 B_1,d<V_1 B_2),AND(d>V_2 B_1,d<V_2 B_2),AND(d>V_3 B_1,d<V_3 B_2),AND(d>V_4 B_1,d<V_4 B_2),AND(d>V_5 B_1,d<V_5 B_2),AND(d>V_6 B_1,d<V_6 B_2)),d,0)","v":42472},{"$f":"IF(OR(AND(d>V_1 C_1,d<V_1 C_2),AND(d>V_2 C_1,d<V_2 C_2),AND(d>V_3 C_1,d<V_3 C_2),AND(d>V_4 C_1,d<V_4 C_2),AND(d>V_5 C_1,d<V_5 C_2),AND(d>V_6 C_1,d<V_6 C_2)),d,0)","v":0},42472,0]
[null,null,null,null,null,null,null,null,"2016-04-13",null,{"$f":"IF(OR(AND(d>V_1 A_1,d<V_1 A_2),AND(d>V_2 A_1,d<V_2 A_2),AND(d>V_3 A_1,d<V_3 A_2),AND(d>V_4 A_1,d<V_4 A_2),AND(d>V_5 A_1,d<V_5 A_2),AND(d>V_6 A_1,d<V_6 A_2)),d,0)","v":42473},{"$f":"IF(OR(AND(d>V_1 B_1,d<V_1 B_2),AND(d>V_2 B_1,d<V_2 B_2),AND(d>V_3 B_1,d<V_3 B_2),AND(d>V_4 B_1,d<V_4 B_2),AND(d>V_5 B_1,d<V_5 B_2),AND(d>V_6 B_1,d<V_6 B_2)),d,0)","v":42473},{"$f":"IF(OR(AND(d>V_1 C_1,d<V_1 C_2),AND(d>V_2 C_1,d<V_2 C_2),AND(d>V_3 C_1,d<V_3 C_2),AND(d>V_4 C_1,d<V_4 C_2),AND(d>V_5 C_1,d<V_5 C_2),AND(d>V_6 C_1,d<V_6 C_2)),d,0)","v":0},42473,0]
[null,null,null,null,null,null,null,null,"2016-04-14",null,{"$f":"IF(OR(AND(d>V_1 A_1,d<V_1 A_2),AND(d>V_2 A_1,d<V_2 A_2),AND(d>V_3 A_1,d<V_3 A_2),AND(d>V_4 A_1,d<V_4 A_2),AND(d>V_5 A_1,d<V_5 A_2),AND(d>V_6 A_1,d<V_6 A_2)),d,0)","v":42474},{"$f":"IF(OR(AND(d>V_1 B_1,d<V_1 B_2),AND(d>V_2 B_1,d<V_2 B_2),AND(d>V_3 B_1,d<V_3 B_2),AND(d>V_4 B_1,d<V_4 B_2),AND(d>V_5 B_1,d<V_5 B_2),AND(d>V_6 B_1,d<V_6 B_2)),d,0)","v":42474},{"$f":"IF(OR(AND(d>V_1 C_1,d<V_1 C_2),AND(d>V_2 C_1,d<V_2 C_2),AND(d>V_3 C_1,d<V_3 C_2),AND(d>V_4 C_1,d<V_4 C_2),AND(d>V_5 C_1,d<V_5 C_2),AND(d>V_6 C_1,d<V_6 C_2)),d,0)","v":0},42474,0]
[null,null,null,null,null,null,null,null,"2016-04-15",null,{"$f":"IF(OR(AND(d>V_1 A_1,d<V_1 A_2),AND(d>V_2 A_1,d<V_2 A_2),AND(d>V_3 A_1,d<V_3 A_2),AND(d>V_4 A_1,d<V_4 A_2),AND(d>V_5 A_1,d<V_5 A_2),AND(d>V_6 A_1,d<V_6 A_2)),d,0)","v":42475},{"$f":"IF(OR(AND(d>V_1 B_1,d<V_1 B_2),AND(d>V_2 B_1,d<V_2 B_2),AND(d>V_3 B_1,d<V_3 B_2),AND(d>V_4 B_1,d<V_4 B_2),AND(d>V_5 B_1,d<V_5 B_2),AND(d>V_6 B_1,d<V_6 B_2)),d,0)","v":42475},{"$f":"IF(OR(AND(d>V_1 C_1,d<V_1 C_2),AND(d>V_2 C_1,d<V_2 C_2),AND(d>V_3 C_1,d<V_3 C_2),AND(d>V_4 C_1,d<V_4 C_2),AND(d>V_5 C_1,d<V_5 C_2),AND(d>V_6 C_1,d<V_6 C_2)),d,0)","v":0},42475,0]
[null,null,null,null,null,null,null,null,"2016-04-16",null,{"$f":"IF(OR(AND(d>V_1 A_1,d<V_1 A_2),AND(d>V_2 A_1,d<V_2 A_2),AND(d>V_3 A_1,d<V_3 A_2),AND(d>V_4 A_1,d<V_4 A_2),AND(d>V_5 A_1,d<V_5 A_2),AND(d>V_6 A_1,d<V_6 A_2)),d,0)","v":42476},{"$f":"IF(OR(AND(d>V_1 B_1,d<V_1 B_2),AND(d>V_2 B_1,d<V_2 B_2),AND(d>V_3 B_1,d<V_3 B_2),AND(d>V_4 B_1,d<V_4 B_2),AND(d>V_5 B_1,d<V_5 B_2),AND(d>V_6 B_1,d<V_6 B_2)),d,0)","v":42476},{"$f":"IF(OR(AND(d>V_1 C_1,d<V_1 C_2),AND(d>V_2 C_1,d<V_2 C_2),AND(d>V_3 C_1,d<V_3 C_2),AND(d>V_4 C_1,d<V_4 C_2),AND(d>V_5 C_1,d<V_5 C_2),AND(d>V_6 C_1,d<V_6 C_2)),d,0)","v":0},42476,0]
[null,null,null,null,null,null,null,null,"2016-04-17",null,{"$f":"IF(OR(AND(d>V_1 A_1,d<V_1 A_2),AND(d>V_2 A_1,d<V_2 A_2),AND(d>V_3 A_1,d<V_3 A_2),AND(d>V_4 A_1,d<V_4 A_2),AND(d>V_5 A_1,d<V_5 A_2),AND(d>V_6 A_1,d<V_6 A_2)),d,0)","v":42477},{"$f":"IF(OR(AND(d>V_1 B_1,d<V_1 B_2),AND(d>V_2 B_1,d<V_2 B_2),AND(d>V_3 B_1,d<V_3 B_2),AND(d>V_4 B_1,d<V_4 B_2),AND(d>V_5 B_1,d<V_5 B_2),AND(d>V_6 B_1,d<V_6 B_2)),d,0)","v":42477},{"$f":"IF(OR(AND(d>V_1 C_1,d<V_1 C_2),AND(d>V_2 C_1,d<V_2 C_2),AND(d>V_3 C_1,d<V_3 C_2),AND(d>V_4 C_1,d<V_4 C_2),AND(d>V_5 C_1,d<V_5 C_2),AND(d>V_6 C_1,d<V_6 C_2)),d,0)","v":42477},42477,42477]
[null,null,null,null,null,null,null,null,"2016-04-18",null,{"$f":"IF(OR(AND(d>V_1 A_1,d<V_1 A_2),AND(d>V_2 A_1,d<V_2 A_2),AND(d>V_3 A_1,d<V_3 A_2),AND(d>V_4 A_1,d<V_4 A_2),AND(d>V_5 A_1,d<V_5 A_2),AND(d>V_6 A_1,d<V_6 A_2)),d,0)","v":42478},{"$f":"IF(OR(AND(d>V_1 B_1,d<V_1 B_2),AND(d>V_2 B_1,d<V_2 B_2),AND(d>V_3 B_1,d<V_3 B_2),AND(d>V_4 B_1,d<V_4 B_2),AND(d>V_5 B_1,d<V_5 B_2),AND(d>V_6 B_1,d<V_6 B_2)),d,0)","v":0},{"$f":"IF(OR(AND(d>V_1 C_1,d<V_1 C_2),AND(d>V_2 C_1,d<V_2 C_2),AND(d>V_3 C_1,d<V_3 C_2),AND(d>V_4 C_1,d<V_4 C_2),AND(d>V_5 C_1,d<V_5 C_2),AND(d>V_6 C_1,d<V_6 C_2)),d,0)","v":42478},42478,42478]
[null,null,null,null,null,null,null,null,"2016-04-19",null,{"$f":"IF(OR(AND(d>V_1 A_1,d<V_1 A_2),AND(d>V_2 A_1,d<V_2 A_2),AND(d>V_3 A_1,d<V_3 A_2),AND(d>V_4 A_1,d<V_4 A_2),AND(d>V_5 A_1,d<V_5 A_2),AND(d>V_6 A_1,d<V_6 A_2)),d,0)","v":42479},{"$f":"IF(OR(AND(d>V_1 B_1,d<V_1 B_2),AND(d>V_2 B_1,d<V_2 B_2),AND(d>V_3 B_1,d<V_3 B_2),AND(d>V_4 B_1,d<V_4 B_2),AND(d>V_5 B_1,d<V_5 B_2),AND(d>V_6 B_1,d<V_6 B_2)),d,0)","v":0},{"$f":"IF(OR(AND(d>V_1 C_1,d<V_1 C_2),AND(d>V_2 C_1,d<V_2 C_2),AND(d>V_3 C_1,d<V_3 C_2),AND(d>V_4 C_1,d<V_4 C_2),AND(d>V_5 C_1,d<V_5 C_2),AND(d>V_6 C_1,d<V_6 C_2)),d,0)","v":42479},42479,42479]
[null,null,null,null,null,null,null,null,"2016-04-20",null,{"$f":"IF(OR(AND(d>V_1 A_1,d<V_1 A_2),AND(d>V_2 A_1,d<V_2 A_2),AND(d>V_3 A_1,d<V_3 A_2),AND(d>V_4 A_1,d<V_4 A_2),AND(d>V_5 A_1,d<V_5 A_2),AND(d>V_6 A_1,d<V_6 A_2)),d,0)","v":42480},{"$f":"IF(OR(AND(d>V_1 B_1,d<V_1 B_2),AND(d>V_2 B_1,d<V_2 B_2),AND(d>V_3 B_1,d<V_3 B_2),AND(d>V_4 B_1,d<V_4 B_2),AND(d>V_5 B_1,d<V_5 B_2),AND(d>V_6 B_1,d<V_6 B_2)),d,0)","v":0},{"$f":"IF(OR(AND(d>V_1 C_1,d<V_1 C_2),AND(d>V_2 C_1,d<V_2 C_2),AND(d>V_3 C_1,d<V_3 C_2),AND(d>V_4 C_1,d<V_4 C_2),AND(d>V_5 C_1,d<V_5 C_2),AND(d>V_6 C_1,d<V_6 C_2)),d,0)","v":42480},42480,42480]
[null,null,null,null,null,null,null,null,"2016-04-21",null,{"$f":"IF(OR(AND(d>V_1 A_1,d<V_1 A_2),AND(d>V_2 A_1,d<V_2 A_2),AND(d>V_3 A_1,d<V_3 A_2),AND(d>V_4 A_1,d<V_4 A_2),AND(d>V_5 A_1,d<V_5 A_2),AND(d>V_6 A_1,d<V_6 A_2)),d,0)","v":42481},{"$f":"IF(OR(AND(d>V_1 B_1,d<V_1 B_2),AND(d>V_2 B_1,d<V_2 B_2),AND(d>V_3 B_1,d<V_3 B_2),AND(d>V_4 B_1,d<V_4 B_2),AND(d>V_5 B_1,d<V_5 B_2),AND(d>V_6 B_1,d<V_6 B_2)),d,0)","v":0},{"$f":"IF(OR(AND(d>V_1 C_1,d<V_1 C_2),AND(d>V_2 C_1,d<V_2 C_2),AND(d>V_3 C_1,d<V_3 C_2),AND(d>V_4 C_1,d<V_4 C_2),AND(d>V_5 C_1,d<V_5 C_2),AND(d>V_6 C_1,d<V_6 C_2)),d,0)","v":42481},42481,42481]
[null,null,null,null,null,null,null,null,"2016-04-22",null,{"$f":"IF(OR(AND(d>V_1 A_1,d<V_1 A_2),AND(d>V_2 A_1,d<V_2 A_2),AND(d>V_3 A_1,d<V_3 A_2),AND(d>V_4 A_1,d<V_4 A_2),AND(d>V_5 A_1,d<V_5 A_2),AND(d>V_6 A_1,d<V_6 A_2)),d,0)","v":42482},{"$f":"IF(OR(AND(d>V_1 B_1,d<V_1 B_2),AND(d>V_2 B_1,d<V_2 B_2),AND(d>V_3 B_1,d<V_3 B_2),AND(d>V_4 B_1,d<V_4 B_2),AND(d>V_5 B_1,d<V_5 B_2),AND(d>V_6 B_1,d<V_6 B_2)),d,0)","v":0},{"$f":"IF(OR(AND(d>V_1 C_1,d<V_1 C_2),AND(d>V_2 C_1,d<V_2 C_2),AND(d>V_3 C_1,d<V_3 C_2),AND(d>V_4 C_1,d<V_4 C_2),AND(d>V_5 C_1,d<V_5 C_2),AND(d>V_6 C_1,d<V_6 C_2)),d,0)","v":42482},42482,42482]
[null,null,null,null,null,null,null,null,"2016-04-23",null,{"$f":"IF(OR(AND(d>V_1 A_1,d<V_1 A_2),AND(d>V_2 A_1,d<V_2 A_2),AND(d>V_3 A_1,d<V_3 A_2),AND(d>V_4 A_1,d<V_4 A_2),AND(d>V_5 A_1,d<V_5 A_2),AND(d>V_6 A_1,d<V_6 A_2)),d,0)","v":42483},{"$f":"IF(OR(AND(d>V_1 B_1,d<V_1 B_2),AND(d>V_2 B_1,d<V_2 B_2),AND(d>V_3 B_1,d<V_3 B_2),AND(d>V_4 B_1,d<V_4 B_2),AND(d>V_5 B_1,d<V_5 B_2),AND(d>V_6 B_1,d<V_6 B_2)),d,0)","v":0},{"$f":"IF(OR(AND(d>V_1 C_1,d<V_1 C_2),AND(d>V_2 C_1,d<V_2 C_2),AND(d>V_3 C_1,d<V_3 C_2),AND(d>V_4 C_1,d<V_4 C_2),AND(d>V_5 C_1,d<V_5 C_2),AND(d>V_6 C_1,d<V_6 C_2)),d,0)","v":42483},42483,42483]
[null,null,null,null,null,null,null,null,"2016-04-24",null,{"$f":"IF(OR(AND(d>V_1 A_1,d<V_1 A_2),AND(d>V_2 A_1,d<V_2 A_2),AND(d>V_3 A_1,d<V_3 A_2),AND(d>V_4 A_1,d<V_4 A_2),AND(d>V_5 A_1,d<V_5 A_2),AND(d>V_6 A_1,d<V_6 A_2)),d,0)","v":42484},{"$f":"IF(OR(AND(d>V_1 B_1,d<V_1 B_2),AND(d>V_2 B_1,d<V_2 B_2),AND(d>V_3 B_1,d<V_3 B_2),AND(d>V_4 B_1,d<V_4 B_2),AND(d>V_5 B_1,d<V_5 B_2),AND(d>V_6 B_1,d<V_6 B_2)),d,0)","v":0},{"$f":"IF(OR(AND(d>V_1 C_1,d<V_1 C_2),AND(d>V_2 C_1,d<V_2 C_2),AND(d>V_3 C_1,d<V_3 C_2),AND(d>V_4 C_1,d<V_4 C_2),AND(d>V_5 C_1,d<V_5 C_2),AND(d>V_6 C_1,d<V_6 C_2)),d,0)","v":42484},42484,42484]
[null,null,null,null,null,null,null,null,"2016-04-25",null,{"$f":"IF(OR(AND(d>V_1 A_1,d<V_1 A_2),AND(d>V_2 A_1,d<V_2 A_2),AND(d>V_3 A_1,d<V_3 A_2),AND(d>V_4 A_1,d<V_4 A_2),AND(d>V_5 A_1,d<V_5 A_2),AND(d>V_6 A_1,d<V_6 A_2)),d,0)","v":0},{"$f":"IF(OR(AND(d>V_1 B_1,d<V_1 B_2),AND(d>V_2 B_1,d<V_2 B_2),AND(d>V_3 B_1,d<V_3 B_2),AND(d>V_4 B_1,d<V_4 B_2),AND(d>V_5 B_1,d<V_5 B_2),AND(d>V_6 B_1,d<V_6 B_2)),d,0)","v":0},{"$f":"IF(OR(AND(d>V_1 C_1,d<V_1 C_2),AND(d>V_2 C_1,d<V_2 C_2),AND(d>V_3 C_1,d<V_3 C_2),AND(d>V_4 C_1,d<V_4 C_2),AND(d>V_5 C_1,d<V_5 C_2),AND(d>V_6 C_1,d<V_6 C_2)),d,0)","v":42485},42485,42485]
[null,null,null,null,null,null,null,null,"2016-04-26",null,{"$f":"IF(OR(AND(d>V_1 A_1,d<V_1 A_2),AND(d>V_2 A_1,d<V_2 A_2),AND(d>V_3 A_1,d<V_3 A_2),AND(d>V_4 A_1,d<V_4 A_2),AND(d>V_5 A_1,d<V_5 A_2),AND(d>V_6 A_1,d<V_6 A_2)),d,0)","v":0},{"$f":"IF(OR(AND(d>V_1 B_1,d<V_1 B_2),AND(d>V_2 B_1,d<V_2 B_2),AND(d>V_3 B_1,d<V_3 B_2),AND(d>V_4 B_1,d<V_4 B_2),AND(d>V_5 B_1,d<V_5 B_2),AND(d>V_6 B_1,d<V_6 B_2)),d,0)","v":0},{"$f":"IF(OR(AND(d>V_1 C_1,d<V_1 C_2),AND(d>V_2 C_1,d<V_2 C_2),AND(d>V_3 C_1,d<V_3 C_2),AND(d>V_4 C_1,d<V_4 C_2),AND(d>V_5 C_1,d<V_5 C_2),AND(d>V_6 C_1,d<V_6 C_2)),d,0)","v":42486},42486,42486]
[null,null,null,null,null,null,null,null,"2016-04-27",null,{"$f":"IF(OR(AND(d>V_1 A_1,d<V_1 A_2),AND(d>V_2 A_1,d<V_2 A_2),AND(d>V_3 A_1,d<V_3 A_2),AND(d>V_4 A_1,d<V_4 A_2),AND(d>V_5 A_1,d<V_5 A_2),AND(d>V_6 A_1,d<V_6 A_2)),d,0)","v":0},{"$f":"IF(OR(AND(d>V_1 B_1,d<V_1 B_2),AND(d>V_2 B_1,d<V_2 B_2),AND(d>V_3 B_1,d<V_3 B_2),AND(d>V_4 B_1,d<V_4 B_2),AND(d>V_5 B_1,d<V_5 B_2),AND(d>V_6 B_1,d<V_6 B_2)),d,0)","v":0},{"$f":"IF(OR(AND(d>V_1 C_1,d<V_1 C_2),AND(d>V_2 C_1,d<V_2 C_2),AND(d>V_3 C_1,d<V_3 C_2),AND(d>V_4 C_1,d<V_4 C_2),AND(d>V_5 C_1,d<V_5 C_2),AND(d>V_6 C_1,d<V_6 C_2)),d,0)","v":42487},42487,42487]
[null,null,null,null,null,null,null,null,"2016-04-28",null,{"$f":"IF(OR(AND(d>V_1 A_1,d<V_1 A_2),AND(d>V_2 A_1,d<V_2 A_2),AND(d>V_3 A_1,d<V_3 A_2),AND(d>V_4 A_1,d<V_4 A_2),AND(d>V_5 A_1,d<V_5 A_2),AND(d>V_6 A_1,d<V_6 A_2)),d,0)","v":0},{"$f":"IF(OR(AND(d>V_1 B_1,d<V_1 B_2),AND(d>V_2 B_1,d<V_2 B_2),AND(d>V_3 B_1,d<V_3 B_2),AND(d>V_4 B_1,d<V_4 B_2),AND(d>V_5 B_1,d<V_5 B_2),AND(d>V_6 B_1,d<V_6 B_2)),d,0)","v":0},{"$f":"IF(OR(AND(d>V_1 C_1,d<V_1 C_2),AND(d>V_2 C_1,d<V_2 C_2),AND(d>V_3 C_1,d<V_3 C_2),AND(d>V_4 C_1,d<V_4 C_2),AND(d>V_5 C_1,d<V_5 C_2),AND(d>V_6 C_1,d<V_6 C_2)),d,0)","v":42488},42488,42488]
[null,null,null,null,null,null,null,null,"2016-04-29",null,{"$f":"IF(OR(AND(d>V_1 A_1,d<V_1 A_2),AND(d>V_2 A_1,d<V_2 A_2),AND(d>V_3 A_1,d<V_3 A_2),AND(d>V_4 A_1,d<V_4 A_2),AND(d>V_5 A_1,d<V_5 A_2),AND(d>V_6 A_1,d<V_6 A_2)),d,0)","v":0},{"$f":"IF(OR(AND(d>V_1 B_1,d<V_1 B_2),AND(d>V_2 B_1,d<V_2 B_2),AND(d>V_3 B_1,d<V_3 B_2),AND(d>V_4 B_1,d<V_4 B_2),AND(d>V_5 B_1,d<V_5 B_2),AND(d>V_6 B_1,d<V_6 B_2)),d,0)","v":0},{"$f":"IF(OR(AND(d>V_1 C_1,d<V_1 C_2),AND(d>V_2 C_1,d<V_2 C_2),AND(d>V_3 C_1,d<V_3 C_2),AND(d>V_4 C_1,d<V_4 C_2),AND(d>V_5 C_1,d<V_5 C_2),AND(d>V_6 C_1,d<V_6 C_2)),d,0)","v":42489},42489,42489]
[null,null,null,null,null,null,null,null,"2016-04-30",null,{"$f":"IF(OR(AND(d>V_1 A_1,d<V_1 A_2),AND(d>V_2 A_1,d<V_2 A_2),AND(d>V_3 A_1,d<V_3 A_2),AND(d>V_4 A_1,d<V_4 A_2),AND(d>V_5 A_1,d<V_5 A_2),AND(d>V_6 A_1,d<V_6 A_2)),d,0)","v":0},{"$f":"IF(OR(AND(d>V_1 B_1,d<V_1 B_2),AND(d>V_2 B_1,d<V_2 B_2),AND(d>V_3 B_1,d<V_3 B_2),AND(d>V_4 B_1,d<V_4 B_2),AND(d>V_5 B_1,d<V_5 B_2),AND(d>V_6 B_1,d<V_6 B_2)),d,0)","v":0},{"$f":"IF(OR(AND(d>V_1 C_1,d<V_1 C_2),AND(d>V_2 C_1,d<V_2 C_2),AND(d>V_3 C_1,d<V_3 C_2),AND(d>V_4 C_1,d<V_4 C_2),AND(d>V_5 C_1,d<V_5 C_2),AND(d>V_6 C_1,d<V_6 C_2)),d,0)","v":42490},42490,42490]
[null,null,null,null,null,null,null,null,"2016-05-01",null,{"$f":"IF(OR(AND(d>V_1 A_1,d<V_1 A_2),AND(d>V_2 A_1,d<V_2 A_2),AND(d>V_3 A_1,d<V_3 A_2),AND(d>V_4 A_1,d<V_4 A_2),AND(d>V_5 A_1,d<V_5 A_2),AND(d>V_6 A_1,d<V_6 A_2)),d,0)","v":0},{"$f":"IF(OR(AND(d>V_1 B_1,d<V_1 B_2),AND(d>V_2 B_1,d<V_2 B_2),AND(d>V_3 B_1,d<V_3 B_2),AND(d>V_4 B_1,d<V_4 B_2),AND(d>V_5 B_1,d<V_5 B_2),AND(d>V_6 B_1,d<V_6 B_2)),d,0)","v":0},{"$f":"IF(OR(AND(d>V_1 C_1,d<V_1 C_2),AND(d>V_2 C_1,d<V_2 C_2),AND(d>V_3 C_1,d<V_3 C_2),AND(d>V_4 C_1,d<V_4 C_2),AND(d>V_5 C_1,d<V_5 C_2),AND(d>V_6 C_1,d<V_6 C_2)),d,0)","v":42491},42491,42491]
[null,null,null,null,null,null,null,null,"2016-05-02",null,{"$f":"IF(OR(AND(d>V_1 A_1,d<V_1 A_2),AND(d>V_2 A_1,d<V_2 A_2),AND(d>V_3 A_1,d<V_3 A_2),AND(d>V_4 A_1,d<V_4 A_2),AND(d>V_5 A_1,d<V_5 A_2),AND(d>V_6 A_1,d<V_6 A_2)),d,0)","v":0},{"$f":"IF(OR(AND(d>V_1 B_1,d<V_1 B_2),AND(d>V_2 B_1,d<V_2 B_2),AND(d>V_3 B_1,d<V_3 B_2),AND(d>V_4 B_1,d<V_4 B_2),AND(d>V_5 B_1,d<V_5 B_2),AND(d>V_6 B_1,d<V_6 B_2)),d,0)","v":0},{"$f":"IF(OR(AND(d>V_1 C_1,d<V_1 C_2),AND(d>V_2 C_1,d<V_2 C_2),AND(d>V_3 C_1,d<V_3 C_2),AND(d>V_4 C_1,d<V_4 C_2),AND(d>V_5 C_1,d<V_5 C_2),AND(d>V_6 C_1,d<V_6 C_2)),d,0)","v":0},0,0]
[null,null,null,null,null,null,null,null,"2016-05-03",null,{"$f":"IF(OR(AND(d>V_1 A_1,d<V_1 A_2),AND(d>V_2 A_1,d<V_2 A_2),AND(d>V_3 A_1,d<V_3 A_2),AND(d>V_4 A_1,d<V_4 A_2),AND(d>V_5 A_1,d<V_5 A_2),AND(d>V_6 A_1,d<V_6 A_2)),d,0)","v":0},{"$f":"IF(OR(AND(d>V_1 B_1,d<V_1 B_2),AND(d>V_2 B_1,d<V_2 B_2),AND(d>V_3 B_1,d<V_3 B_2),AND(d>V_4 B_1,d<V_4 B_2),AND(d>V_5 B_1,d<V_5 B_2),AND(d>V_6 B_1,d<V_6 B_2)),d,0)","v":0},{"$f":"IF(OR(AND(d>V_1 C_1,d<V_1 C_2),AND(d>V_2 C_1,d<V_2 C_2),AND(d>V_3 C_1,d<V_3 C_2),AND(d>V_4 C_1,d<V_4 C_2),AND(d>V_5 C_1,d<V_5 C_2),AND(d>V_6 C_1,d<V_6 C_2)),d,0)","v":0},0,0]
[null,null,null,null,null,null,null,null,"2016-05-04",null,{"$f":"IF(OR(AND(d>V_1 A_1,d<V_1 A_2),AND(d>V_2 A_1,d<V_2 A_2),AND(d>V_3 A_1,d<V_3 A_2),AND(d>V_4 A_1,d<V_4 A_2),AND(d>V_5 A_1,d<V_5 A_2),AND(d>V_6 A_1,d<V_6 A_2)),d,0)","v":0},{"$f":"IF(OR(AND(d>V_1 B_1,d<V_1 B_2),AND(d>V_2 B_1,d<V_2 B_2),AND(d>V_3 B_1,d<V_3 B_2),AND(d>V_4 B_1,d<V_4 B_2),AND(d>V_5 B_1,d<V_5 B_2),AND(d>V_6 B_1,d<V_6 B_2)),d,0)","v":0},{"$f":"IF(OR(AND(d>V_1 C_1,d<V_1 C_2),AND(d>V_2 C_1,d<V_2 C_2),AND(d>V_3 C_1,d<V_3 C_2),AND(d>V_4 C_1,d<V_4 C_2),AND(d>V_5 C_1,d<V_5 C_2),AND(d>V_6 C_1,d<V_6 C_2)),d,0)","v":0},0,0]
[null,null,null,null,null,null,null,null,"2016-05-05",null,{"$f":"IF(OR(AND(d>V_1 A_1,d<V_1 A_2),AND(d>V_2 A_1,d<V_2 A_2),AND(d>V_3 A_1,d<V_3 A_2),AND(d>V_4 A_1,d<V_4 A_2),AND(d>V_5 A_1,d<V_5 A_2),AND(d>V_6 A_1,d<V_6 A_2)),d,0)","v":0},{"$f":"IF(OR(AND(d>V_1 B_1,d<V_1 B_2),AND(d>V_2 B_1,d<V_2 B_2),AND(d>V_3 B_1,d<V_3 B_2),AND(d>V_4 B_1,d<V_4 B_2),AND(d>V_5 B_1,d<V_5 B_2),AND(d>V_6 B_1,d<V_6 B_2)),d,0)","v":0},{"$f":"IF(OR(AND(d>V_1 C_1,d<V_1 C_2),AND(d>V_2 C_1,d<V_2 C_2),AND(d>V_3 C_1,d<V_3 C_2),AND(d>V_4 C_1,d<V_4 C_2),AND(d>V_5 C_1,d<V_5 C_2),AND(d>V_6 C_1,d<V_6 C_2)),d,0)","v":0},0,0]
[null,null,null,null,null,null,null,null,"2016-05-06",null,{"$f":"IF(OR(AND(d>V_1 A_1,d<V_1 A_2),AND(d>V_2 A_1,d<V_2 A_2),AND(d>V_3 A_1,d<V_3 A_2),AND(d>V_4 A_1,d<V_4 A_2),AND(d>V_5 A_1,d<V_5 A_2),AND(d>V_6 A_1,d<V_6 A_2)),d,0)","v":0},{"$f":"IF(OR(AND(d>V_1 B_1,d<V_1 B_2),AND(d>V_2 B_1,d<V_2 B_2),AND(d>V_3 B_1,d<V_3 B_2),AND(d>V_4 B_1,d<V_4 B_2),AND(d>V_5 B_1,d<V_5 B_2),AND(d>V_6 B_1,d<V_6 B_2)),d,0)","v":0},{"$f":"IF(OR(AND(d>V_1 C_1,d<V_1 C_2),AND(d>V_2 C_1,d<V_2 C_2),AND(d>V_3 C_1,d<V_3 C_2),AND(d>V_4 C_1,d<V_4 C_2),AND(d>V_5 C_1,d<V_5 C_2),AND(d>V_6 C_1,d<V_6 C_2)),d,0)","v":0},0,0]
[null,null,null,null,null,null,null,null,"2016-05-07",null,{"$f":"IF(OR(AND(d>V_1 A_1,d<V_1 A_2),AND(d>V_2 A_1,d<V_2 A_2),AND(d>V_3 A_1,d<V_3 A_2),AND(d>V_4 A_1,d<V_4 A_2),AND(d>V_5 A_1,d<V_5 A_2),AND(d>V_6 A_1,d<V_6 A_2)),d,0)","v":0},{"$f":"IF(OR(AND(d>V_1 B_1,d<V_1 B_2),AND(d>V_2 B_1,d<V_2 B_2),AND(d>V_3 B_1,d<V_3 B_2),AND(d>V_4 B_1,d<V_4 B_2),AND(d>V_5 B_1,d<V_5 B_2),AND(d>V_6 B_1,d<V_6 B_2)),d,0)","v":0},{"$f":"IF(OR(AND(d>V_1 C_1,d<V_1 C_2),AND(d>V_2 C_1,d<V_2 C_2),AND(d>V_3 C_1,d<V_3 C_2),AND(d>V_4 C_1,d<V_4 C_2),AND(d>V_5 C_1,d<V_5 C_2),AND(d>V_6 C_1,d<V_6 C_2)),d,0)","v":0},0,0]
[null,null,null,null,null,null,null,null,"2016-05-08",null,{"$f":"IF(OR(AND(d>V_1 A_1,d<V_1 A_2),AND(d>V_2 A_1,d<V_2 A_2),AND(d>V_3 A_1,d<V_3 A_2),AND(d>V_4 A_1,d<V_4 A_2),AND(d>V_5 A_1,d<V_5 A_2),AND(d>V_6 A_1,d<V_6 A_2)),d,0)","v":0},{"$f":"IF(OR(AND(d>V_1 B_1,d<V_1 B_2),AND(d>V_2 B_1,d<V_2 B_2),AND(d>V_3 B_1,d<V_3 B_2),AND(d>V_4 B_1,d<V_4 B_2),AND(d>V_5 B_1,d<V_5 B_2),AND(d>V_6 B_1,d<V_6 B_2)),d,0)","v":0},{"$f":"IF(OR(AND(d>V_1 C_1,d<V_1 C_2),AND(d>V_2 C_1,d<V_2 C_2),AND(d>V_3 C_1,d<V_3 C_2),AND(d>V_4 C_1,d<V_4 C_2),AND(d>V_5 C_1,d<V_5 C_2),AND(d>V_6 C_1,d<V_6 C_2)),d,0)","v":0},0,0]
[null,null,null,null,null,null,null,null,"2016-05-09",null,{"$f":"IF(OR(AND(d>V_1 A_1,d<V_1 A_2),AND(d>V_2 A_1,d<V_2 A_2),AND(d>V_3 A_1,d<V_3 A_2),AND(d>V_4 A_1,d<V_4 A_2),AND(d>V_5 A_1,d<V_5 A_2),AND(d>V_6 A_1,d<V_6 A_2)),d,0)","v":0},{"$f":"IF(OR(AND(d>V_1 B_1,d<V_1 B_2),AND(d>V_2 B_1,d<V_2 B_2),AND(d>V_3 B_1,d<V_3 B_2),AND(d>V_4 B_1,d<V_4 B_2),AND(d>V_5 B_1,d<V_5 B_2),AND(d>V_6 B_1,d<V_6 B_2)),d,0)","v":0},{"$f":"IF(OR(AND(d>V_1 C_1,d<V_1 C_2),AND(d>V_2 C_1,d<V_2 C_2),AND(d>V_3 C_1,d<V_3 C_2),AND(d>V_4 C_1,d<V_4 C_2),AND(d>V_5 C_1,d<V_5 C_2),AND(d>V_6 C_1,d<V_6 C_2)),d,0)","v":0},0,0]
[null,null,null,null,null,null,null,null,"2016-05-10",null,{"$f":"IF(OR(AND(d>V_1 A_1,d<V_1 A_2),AND(d>V_2 A_1,d<V_2 A_2),AND(d>V_3 A_1,d<V_3 A_2),AND(d>V_4 A_1,d<V_4 A_2),AND(d>V_5 A_1,d<V_5 A_2),AND(d>V_6 A_1,d<V_6 A_2)),d,0)","v":0},{"$f":"IF(OR(AND(d>V_1 B_1,d<V_1 B_2),AND(d>V_2 B_1,d<V_2 B_2),AND(d>V_3 B_1,d<V_3 B_2),AND(d>V_4 B_1,d<V_4 B_2),AND(d>V_5 B_1,d<V_5 B_2),AND(d>V_6 B_1,d<V_6 B_2)),d,0)","v":0},{"$f":"IF(OR(AND(d>V_1 C_1,d<V_1 C_2),AND(d>V_2 C_1,d<V_2 C_2),AND(d>V_3 C_1,d<V_3 C_2),AND(d>V_4 C_1,d<V_4 C_2),AND(d>V_5 C_1,d<V_5 C_2),AND(d>V_6 C_1,d<V_6 C_2)),d,0)","v":0},0,0]
[null,null,null,null,null,null,null,null,"2016-05-11",null,{"$f":"IF(OR(AND(d>V_1 A_1,d<V_1 A_2),AND(d>V_2 A_1,d<V_2 A_2),AND(d>V_3 A_1,d<V_3 A_2),AND(d>V_4 A_1,d<V_4 A_2),AND(d>V_5 A_1,d<V_5 A_2),AND(d>V_6 A_1,d<V_6 A_2)),d,0)","v":0},{"$f":"IF(OR(AND(d>V_1 B_1,d<V_1 B_2),AND(d>V_2 B_1,d<V_2 B_2),AND(d>V_3 B_1,d<V_3 B_2),AND(d>V_4 B_1,d<V_4 B_2),AND(d>V_5 B_1,d<V_5 B_2),AND(d>V_6 B_1,d<V_6 B_2)),d,0)","v":0},{"$f":"IF(OR(AND(d>V_1 C_1,d<V_1 C_2),AND(d>V_2 C_1,d<V_2 C_2),AND(d>V_3 C_1,d<V_3 C_2),AND(d>V_4 C_1,d<V_4 C_2),AND(d>V_5 C_1,d<V_5 C_2),AND(d>V_6 C_1,d<V_6 C_2)),d,0)","v":0},0,0]
[null,null,null,null,null,null,null,null,"2016-05-12",null,{"$f":"IF(OR(AND(d>V_1 A_1,d<V_1 A_2),AND(d>V_2 A_1,d<V_2 A_2),AND(d>V_3 A_1,d<V_3 A_2),AND(d>V_4 A_1,d<V_4 A_2),AND(d>V_5 A_1,d<V_5 A_2),AND(d>V_6 A_1,d<V_6 A_2)),d,0)","v":0},{"$f":"IF(OR(AND(d>V_1 B_1,d<V_1 B_2),AND(d>V_2 B_1,d<V_2 B_2),AND(d>V_3 B_1,d<V_3 B_2),AND(d>V_4 B_1,d<V_4 B_2),AND(d>V_5 B_1,d<V_5 B_2),AND(d>V_6 B_1,d<V_6 B_2)),d,0)","v":0},{"$f":"IF(OR(AND(d>V_1 C_1,d<V_1 C_2),AND(d>V_2 C_1,d<V_2 C_2),AND(d>V_3 C_1,d<V_3 C_2),AND(d>V_4 C_1,d<V_4 C_2),AND(d>V_5 C_1,d<V_5 C_2),AND(d>V_6 C_1,d<V_6 C_2)),d,0)","v":0},0,0]
[null,null,null,null,null,null,null,null,"2016-05-13",null,{"$f":"IF(OR(AND(d>V_1 A_1,d<V_1 A_2),AND(d>V_2 A_1,d<V_2 A_2),AND(d>V_3 A_1,d<V_3 A_2),AND(d>V_4 A_1,d<V_4 A_2),AND(d>V_5 A_1,d<V_5 A_2),AND(d>V_6 A_1,d<V_6 A_2)),d,0)","v":0},{"$f":"IF(OR(AND(d>V_1 B_1,d<V_1 B_2),AND(d>V_2 B_1,d<V_2 B_2),AND(d>V_3 B_1,d<V_3 B_2),AND(d>V_4 B_1,d<V_4 B_2),AND(d>V_5 B_1,d<V_5 B_2),AND(d>V_6 B_1,d<V_6 B_2)),d,0)","v":0},{"$f":"IF(OR(AND(d>V_1 C_1,d<V_1 C_2),AND(d>V_2 C_1,d<V_2 C_2),AND(d>V_3 C_1,d<V_3 C_2),AND(d>V_4 C_1,d<V_4 C_2),AND(d>V_5 C_1,d<V_5 C_2),AND(d>V_6 C_1,d<V_6 C_2)),d,0)","v":0},0,0]
[null,null,null,null,null,null,null,null,"2016-05-14",null,{"$f":"IF(OR(AND(d>V_1 A_1,d<V_1 A_2),AND(d>V_2 A_1,d<V_2 A_2),AND(d>V_3 A_1,d<V_3 A_2),AND(d>V_4 A_1,d<V_4 A_2),AND(d>V_5 A_1,d<V_5 A_2),AND(d>V_6 A_1,d<V_6 A_2)),d,0)","v":0},{"$f":"IF(OR(AND(d>V_1 B_1,d<V_1 B_2),AND(d>V_2 B_1,d<V_2 B_2),AND(d>V_3 B_1,d<V_3 B_2),AND(d>V_4 B_1,d<V_4 B_2),AND(d>V_5 B_1,d<V_5 B_2),AND(d>V_6 B_1,d<V_6 B_2)),d,0)","v":0},{"$f":"IF(OR(AND(d>V_1 C_1,d<V_1 C_2),AND(d>V_2 C_1,d<V_2 C_2),AND(d>V_3 C_1,d<V_3 C_2),AND(d>V_4 C_1,d<V_4 C_2),AND(d>V_5 C_1,d<V_5 C_2),AND(d>V_6 C_1,d<V_6 C_2)),d,0)","v":0},0,0]
[null,null,null,null,null,null,null,null,"2016-05-15",null,{"$f":"IF(OR(AND(d>V_1 A_1,d<V_1 A_2),AND(d>V_2 A_1,d<V_2 A_2),AND(d>V_3 A_1,d<V_3 A_2),AND(d>V_4 A_1,d<V_4 A_2),AND(d>V_5 A_1,d<V_5 A_2),AND(d>V_6 A_1,d<V_6 A_2)),d,0)","v":0},{"$f":"IF(OR(AND(d>V_1 B_1,d<V_1 B_2),AND(d>V_2 B_1,d<V_2 B_2),AND(d>V_3 B_1,d<V_3 B_2),AND(d>V_4 B_1,d<V_4 B_2),AND(d>V_5 B_1,d<V_5 B_2),AND(d>V_6 B_1,d<V_6 B_2)),d,0)","v":0},{"$f":"IF(OR(AND(d>V_1 C_1,d<V_1 C_2),AND(d>V_2 C_1,d<V_2 C_2),AND(d>V_3 C_1,d<V_3 C_2),AND(d>V_4 C_1,d<V_4 C_2),AND(d>V_5 C_1,d<V_5 C_2),AND(d>V_6 C_1,d<V_6 C_2)),d,0)","v":0},0,0]
[null,null,null,null,null,null,null,null,"2016-05-16",null,{"$f":"IF(OR(AND(d>V_1 A_1,d<V_1 A_2),AND(d>V_2 A_1,d<V_2 A_2),AND(d>V_3 A_1,d<V_3 A_2),AND(d>V_4 A_1,d<V_4 A_2),AND(d>V_5 A_1,d<V_5 A_2),AND(d>V_6 A_1,d<V_6 A_2)),d,0)","v":0},{"$f":"IF(OR(AND(d>V_1 B_1,d<V_1 B_2),AND(d>V_2 B_1,d<V_2 B_2),AND(d>V_3 B_1,d<V_3 B_2),AND(d>V_4 B_1,d<V_4 B_2),AND(d>V_5 B_1,d<V_5 B_2),AND(d>V_6 B_1,d<V_6 B_2)),d,0)","v":0},{"$f":"IF(OR(AND(d>V_1 C_1,d<V_1 C_2),AND(d>V_2 C_1,d<V_2 C_2),AND(d>V_3 C_1,d<V_3 C_2),AND(d>V_4 C_1,d<V_4 C_2),AND(d>V_5 C_1,d<V_5 C_2),AND(d>V_6 C_1,d<V_6 C_2)),d,0)","v":0},0,0]
[null,null,null,null,null,null,null,null,"2016-05-17",null,{"$f":"IF(OR(AND(d>V_1 A_1,d<V_1 A_2),AND(d>V_2 A_1,d<V_2 A_2),AND(d>V_3 A_1,d<V_3 A_2),AND(d>V_4 A_1,d<V_4 A_2),AND(d>V_5 A_1,d<V_5 A_2),AND(d>V_6 A_1,d<V_6 A_2)),d,0)","v":0},{"$f":"IF(OR(AND(d>V_1 B_1,d<V_1 B_2),AND(d>V_2 B_1,d<V_2 B_2),AND(d>V_3 B_1,d<V_3 B_2),AND(d>V_4 B_1,d<V_4 B_2),AND(d>V_5 B_1,d<V_5 B_2),AND(d>V_6 B_1,d<V_6 B_2)),d,0)","v":0},{"$f":"IF(OR(AND(d>V_1 C_1,d<V_1 C_2),AND(d>V_2 C_1,d<V_2 C_2),AND(d>V_3 C_1,d<V_3 C_2),AND(d>V_4 C_1,d<V_4 C_2),AND(d>V_5 C_1,d<V_5 C_2),AND(d>V_6 C_1,d<V_6 C_2)),d,0)","v":0},0,0]
[null,null,null,null,null,null,null,null,"2016-05-18",null,{"$f":"IF(OR(AND(d>V_1 A_1,d<V_1 A_2),AND(d>V_2 A_1,d<V_2 A_2),AND(d>V_3 A_1,d<V_3 A_2),AND(d>V_4 A_1,d<V_4 A_2),AND(d>V_5 A_1,d<V_5 A_2),AND(d>V_6 A_1,d<V_6 A_2)),d,0)","v":0},{"$f":"IF(OR(AND(d>V_1 B_1,d<V_1 B_2),AND(d>V_2 B_1,d<V_2 B_2),AND(d>V_3 B_1,d<V_3 B_2),AND(d>V_4 B_1,d<V_4 B_2),AND(d>V_5 B_1,d<V_5 B_2),AND(d>V_6 B_1,d<V_6 B_2)),d,0)","v":0},{"$f":"IF(OR(AND(d>V_1 C_1,d<V_1 C_2),AND(d>V_2 C_1,d<V_2 C_2),AND(d>V_3 C_1,d<V_3 C_2),AND(d>V_4 C_1,d<V_4 C_2),AND(d>V_5 C_1,d<V_5 C_2),AND(d>V_6 C_1,d<V_6 C_2)),d,0)","v":0},0,0]
[null,null,null,null,null,null,null,null,"2016-05-19",null,{"$f":"IF(OR(AND(d>V_1 A_1,d<V_1 A_2),AND(d>V_2 A_1,d<V_2 A_2),AND(d>V_3 A_1,d<V_3 A_2),AND(d>V_4 A_1,d<V_4 A_2),AND(d>V_5 A_1,d<V_5 A_2),AND(d>V_6 A_1,d<V_6 A_2)),d,0)","v":0},{"$f":"IF(OR(AND(d>V_1 B_1,d<V_1 B_2),AND(d>V_2 B_1,d<V_2 B_2),AND(d>V_3 B_1,d<V_3 B_2),AND(d>V_4 B_1,d<V_4 B_2),AND(d>V_5 B_1,d<V_5 B_2),AND(d>V_6 B_1,d<V_6 B_2)),d,0)","v":0},{"$f":"IF(OR(AND(d>V_1 C_1,d<V_1 C_2),AND(d>V_2 C_1,d<V_2 C_2),AND(d>V_3 C_1,d<V_3 C_2),AND(d>V_4 C_1,d<V_4 C_2),AND(d>V_5 C_1,d<V_5 C_2),AND(d>V_6 C_1,d<V_6 C_2)),d,0)","v":0},0,{"$f":"INDEX(J330:N330,choix_zone)","v":0}]
[null,null,null,null,null,null,null,null,"2016-05-20",null,{"$f":"IF(OR(AND(d>V_1 A_1,d<V_1 A_2),AND(d>V_2 A_1,d<V_2 A_2),AND(d>V_3 A_1,d<V_3 A_2),AND(d>V_4 A_1,d<V_4 A_2),AND(d>V_5 A_1,d<V_5 A_2),AND(d>V_6 A_1,d<V_6 A_2)),d,0)","v":0},{"$f":"IF(OR(AND(d>V_1 B_1,d<V_1 B_2),AND(d>V_2 B_1,d<V_2 B_2),AND(d>V_3 B_1,d<V_3 B_2),AND(d>V_4 B_1,d<V_4 B_2),AND(d>V_5 B_1,d<V_5 B_2),AND(d>V_6 B_1,d<V_6 B_2)),d,0)","v":0},{"$f":"IF(OR(AND(d>V_1 C_1,d<V_1 C_2),AND(d>V_2 C_1,d<V_2 C_2),AND(d>V_3 C_1,d<V_3 C_2),AND(d>V_4 C_1,d<V_4 C_2),AND(d>V_5 C_1,d<V_5 C_2),AND(d>V_6 C_1,d<V_6 C_2)),d,0)","v":0},{"$f":"MAX(K331:M331)","v":0},0]
[null,null,null,null,null,null,null,null,{"$f":"I331+1","v":"2016-05-21"},null,{"$f":"IF(OR(AND(d>V_1 A_1,d<V_1 A_2),AND(d>V_2 A_1,d<V_2 A_2),AND(d>V_3 A_1,d<V_3 A_2),AND(d>V_4 A_1,d<V_4 A_2),AND(d>V_5 A_1,d<V_5 A_2),AND(d>V_6 A_1,d<V_6 A_2)),d,0)","v":0},{"$f":"IF(OR(AND(d>V_1 B_1,d<V_1 B_2),AND(d>V_2 B_1,d<V_2 B_2),AND(d>V_3 B_1,d<V_3 B_2),AND(d>V_4 B_1,d<V_4 B_2),AND(d>V_5 B_1,d<V_5 B_2),AND(d>V_6 B_1,d<V_6 B_2)),d,0)","v":0},{"$f":"IF(OR(AND(d>V_1 C_1,d<V_1 C_2),AND(d>V_2 C_1,d<V_2 C_2),AND(d>V_3 C_1,d<V_3 C_2),AND(d>V_4 C_1,d<V_4 C_2),AND(d>V_5 C_1,d<V_5 C_2),AND(d>V_6 C_1,d<V_6 C_2)),d,0)","v":0},0,0]
[null,null,null,null,null,null,null,null,"2016-05-22",null,{"$f":"IF(OR(AND(d>V_1 A_1,d<V_1 A_2),AND(d>V_2 A_1,d<V_2 A_2),AND(d>V_3 A_1,d<V_3 A_2),AND(d>V_4 A_1,d<V_4 A_2),AND(d>V_5 A_1,d<V_5 A_2),AND(d>V_6 A_1,d<V_6 A_2)),d,0)","v":0},{"$f":"IF(OR(AND(d>V_1 B_1,d<V_1 B_2),AND(d>V_2 B_1,d<V_2 B_2),AND(d>V_3 B_1,d<V_3 B_2),AND(d>V_4 B_1,d<V_4 B_2),AND(d>V_5 B_1,d<V_5 B_2),AND(d>V_6 B_1,d<V_6 B_2)),d,0)","v":0},{"$f":"IF(OR(AND(d>V_1 C_1,d<V_1 C_2),AND(d>V_2 C_1,d<V_2 C_2),AND(d>V_3 C_1,d<V_3 C_2),AND(d>V_4 C_1,d<V_4 C_2),AND(d>V_5 C_1,d<V_5 C_2),AND(d>V_6 C_1,d<V_6 C_2)),d,0)","v":0},0,0]
[null,null,null,null,null,null,null,null,"2016-05-23",null,{"$f":"IF(OR(AND(d>V_1 A_1,d<V_1 A_2),AND(d>V_2 A_1,d<V_2 A_2),AND(d>V_3 A_1,d<V_3 A_2),AND(d>V_4 A_1,d<V_4 A_2),AND(d>V_5 A_1,d<V_5 A_2),AND(d>V_6 A_1,d<V_6 A_2)),d,0)","v":0},{"$f":"IF(OR(AND(d>V_1 B_1,d<V_1 B_2),AND(d>V_2 B_1,d<V_2 B_2),AND(d>V_3 B_1,d<V_3 B_2),AND(d>V_4 B_1,d<V_4 B_2),AND(d>V_5 B_1,d<V_5 B_2),AND(d>V_6 B_1,d<V_6 B_2)),d,0)","v":0},{"$f":"IF(OR(AND(d>V_1 C_1,d<V_1 C_2),AND(d>V_2 C_1,d<V_2 C_2),AND(d>V_3 C_1,d<V_3 C_2),AND(d>V_4 C_1,d<V_4 C_2),AND(d>V_5 C_1,d<V_5 C_2),AND(d>V_6 C_1,d<V_6 C_2)),d,0)","v":0},0,0]
[null,null,null,null,null,null,null,null,"2016-05-24",null,{"$f":"IF(OR(AND(d>V_1 A_1,d<V_1 A_2),AND(d>V_2 A_1,d<V_2 A_2),AND(d>V_3 A_1,d<V_3 A_2),AND(d>V_4 A_1,d<V_4 A_2),AND(d>V_5 A_1,d<V_5 A_2),AND(d>V_6 A_1,d<V_6 A_2)),d,0)","v":0},{"$f":"IF(OR(AND(d>V_1 B_1,d<V_1 B_2),AND(d>V_2 B_1,d<V_2 B_2),AND(d>V_3 B_1,d<V_3 B_2),AND(d>V_4 B_1,d<V_4 B_2),AND(d>V_5 B_1,d<V_5 B_2),AND(d>V_6 B_1,d<V_6 B_2)),d,0)","v":0},{"$f":"IF(OR(AND(d>V_1 C_1,d<V_1 C_2),AND(d>V_2 C_1,d<V_2 C_2),AND(d>V_3 C_1,d<V_3 C_2),AND(d>V_4 C_1,d<V_4 C_2),AND(d>V_5 C_1,d<V_5 C_2),AND(d>V_6 C_1,d<V_6 C_2)),d,0)","v":0},0,0]
[null,null,null,null,null,null,null,null,"2016-05-25",null,{"$f":"IF(OR(AND(d>V_1 A_1,d<V_1 A_2),AND(d>V_2 A_1,d<V_2 A_2),AND(d>V_3 A_1,d<V_3 A_2),AND(d>V_4 A_1,d<V_4 A_2),AND(d>V_5 A_1,d<V_5 A_2),AND(d>V_6 A_1,d<V_6 A_2)),d,0)","v":0},{"$f":"IF(OR(AND(d>V_1 B_1,d<V_1 B_2),AND(d>V_2 B_1,d<V_2 B_2),AND(d>V_3 B_1,d<V_3 B_2),AND(d>V_4 B_1,d<V_4 B_2),AND(d>V_5 B_1,d<V_5 B_2),AND(d>V_6 B_1,d<V_6 B_2)),d,0)","v":0},{"$f":"IF(OR(AND(d>V_1 C_1,d<V_1 C_2),AND(d>V_2 C_1,d<V_2 C_2),AND(d>V_3 C_1,d<V_3 C_2),AND(d>V_4 C_1,d<V_4 C_2),AND(d>V_5 C_1,d<V_5 C_2),AND(d>V_6 C_1,d<V_6 C_2)),d,0)","v":0},0,0]
[null,null,null,null,null,null,null,null,"2016-05-26",null,{"$f":"IF(OR(AND(d>V_1 A_1,d<V_1 A_2),AND(d>V_2 A_1,d<V_2 A_2),AND(d>V_3 A_1,d<V_3 A_2),AND(d>V_4 A_1,d<V_4 A_2),AND(d>V_5 A_1,d<V_5 A_2),AND(d>V_6 A_1,d<V_6 A_2)),d,0)","v":0},{"$f":"IF(OR(AND(d>V_1 B_1,d<V_1 B_2),AND(d>V_2 B_1,d<V_2 B_2),AND(d>V_3 B_1,d<V_3 B_2),AND(d>V_4 B_1,d<V_4 B_2),AND(d>V_5 B_1,d<V_5 B_2),AND(d>V_6 B_1,d<V_6 B_2)),d,0)","v":0},{"$f":"IF(OR(AND(d>V_1 C_1,d<V_1 C_2),AND(d>V_2 C_1,d<V_2 C_2),AND(d>V_3 C_1,d<V_3 C_2),AND(d>V_4 C_1,d<V_4 C_2),AND(d>V_5 C_1,d<V_5 C_2),AND(d>V_6 C_1,d<V_6 C_2)),d,0)","v":0},0,0]
[null,null,null,null,null,null,null,null,"2016-05-27",null,{"$f":"IF(OR(AND(d>V_1 A_1,d<V_1 A_2),AND(d>V_2 A_1,d<V_2 A_2),AND(d>V_3 A_1,d<V_3 A_2),AND(d>V_4 A_1,d<V_4 A_2),AND(d>V_5 A_1,d<V_5 A_2),AND(d>V_6 A_1,d<V_6 A_2)),d,0)","v":0},{"$f":"IF(OR(AND(d>V_1 B_1,d<V_1 B_2),AND(d>V_2 B_1,d<V_2 B_2),AND(d>V_3 B_1,d<V_3 B_2),AND(d>V_4 B_1,d<V_4 B_2),AND(d>V_5 B_1,d<V_5 B_2),AND(d>V_6 B_1,d<V_6 B_2)),d,0)","v":0},{"$f":"IF(OR(AND(d>V_1 C_1,d<V_1 C_2),AND(d>V_2 C_1,d<V_2 C_2),AND(d>V_3 C_1,d<V_3 C_2),AND(d>V_4 C_1,d<V_4 C_2),AND(d>V_5 C_1,d<V_5 C_2),AND(d>V_6 C_1,d<V_6 C_2)),d,0)","v":0},0,0]
[null,null,null,null,null,null,null,null,"2016-05-28",null,{"$f":"IF(OR(AND(d>V_1 A_1,d<V_1 A_2),AND(d>V_2 A_1,d<V_2 A_2),AND(d>V_3 A_1,d<V_3 A_2),AND(d>V_4 A_1,d<V_4 A_2),AND(d>V_5 A_1,d<V_5 A_2),AND(d>V_6 A_1,d<V_6 A_2)),d,0)","v":0},{"$f":"IF(OR(AND(d>V_1 B_1,d<V_1 B_2),AND(d>V_2 B_1,d<V_2 B_2),AND(d>V_3 B_1,d<V_3 B_2),AND(d>V_4 B_1,d<V_4 B_2),AND(d>V_5 B_1,d<V_5 B_2),AND(d>V_6 B_1,d<V_6 B_2)),d,0)","v":0},{"$f":"IF(OR(AND(d>V_1 C_1,d<V_1 C_2),AND(d>V_2 C_1,d<V_2 C_2),AND(d>V_3 C_1,d<V_3 C_2),AND(d>V_4 C_1,d<V_4 C_2),AND(d>V_5 C_1,d<V_5 C_2),AND(d>V_6 C_1,d<V_6 C_2)),d,0)","v":0},0,0]
[null,null,null,null,null,null,null,null,"2016-05-29",null,{"$f":"IF(OR(AND(d>V_1 A_1,d<V_1 A_2),AND(d>V_2 A_1,d<V_2 A_2),AND(d>V_3 A_1,d<V_3 A_2),AND(d>V_4 A_1,d<V_4 A_2),AND(d>V_5 A_1,d<V_5 A_2),AND(d>V_6 A_1,d<V_6 A_2)),d,0)","v":0},{"$f":"IF(OR(AND(d>V_1 B_1,d<V_1 B_2),AND(d>V_2 B_1,d<V_2 B_2),AND(d>V_3 B_1,d<V_3 B_2),AND(d>V_4 B_1,d<V_4 B_2),AND(d>V_5 B_1,d<V_5 B_2),AND(d>V_6 B_1,d<V_6 B_2)),d,0)","v":0},{"$f":"IF(OR(AND(d>V_1 C_1,d<V_1 C_2),AND(d>V_2 C_1,d<V_2 C_2),AND(d>V_3 C_1,d<V_3 C_2),AND(d>V_4 C_1,d<V_4 C_2),AND(d>V_5 C_1,d<V_5 C_2),AND(d>V_6 C_1,d<V_6 C_2)),d,0)","v":0},0,0]
[null,null,null,null,null,null,null,null,"2016-05-30",null,{"$f":"IF(OR(AND(d>V_1 A_1,d<V_1 A_2),AND(d>V_2 A_1,d<V_2 A_2),AND(d>V_3 A_1,d<V_3 A_2),AND(d>V_4 A_1,d<V_4 A_2),AND(d>V_5 A_1,d<V_5 A_2),AND(d>V_6 A_1,d<V_6 A_2)),d,0)","v":0},{"$f":"IF(OR(AND(d>V_1 B_1,d<V_1 B_2),AND(d>V_2 B_1,d<V_2 B_2),AND(d>V_3 B_1,d<V_3 B_2),AND(d>V_4 B_1,d<V_4 B_2),AND(d>V_5 B_1,d<V_5 B_2),AND(d>V_6 B_1,d<V_6 B_2)),d,0)","v":0},{"$f":"IF(OR(AND(d>V_1 C_1,d<V_1 C_2),AND(d>V_2 C_1,d<V_2 C_2),AND(d>V_3 C_1,d<V_3 C_2),AND(d>V_4 C_1,d<V_4 C_2),AND(d>V_5 C_1,d<V_5 C_2),AND(d>V_6 C_1,d<V_6 C_2)),d,0)","v":0},0,0]
[null,null,null,null,null,null,null,null,"2016-05-31",null,{"$f":"IF(OR(AND(d>V_1 A_1,d<V_1 A_2),AND(d>V_2 A_1,d<V_2 A_2),AND(d>V_3 A_1,d<V_3 A_2),AND(d>V_4 A_1,d<V_4 A_2),AND(d>V_5 A_1,d<V_5 A_2),AND(d>V_6 A_1,d<V_6 A_2)),d,0)","v":0},{"$f":"IF(OR(AND(d>V_1 B_1,d<V_1 B_2),AND(d>V_2 B_1,d<V_2 B_2),AND(d>V_3 B_1,d<V_3 B_2),AND(d>V_4 B_1,d<V_4 B_2),AND(d>V_5 B_1,d<V_5 B_2),AND(d>V_6 B_1,d<V_6 B_2)),d,0)","v":0},{"$f":"IF(OR(AND(d>V_1 C_1,d<V_1 C_2),AND(d>V_2 C_1,d<V_2 C_2),AND(d>V_3 C_1,d<V_3 C_2),AND(d>V_4 C_1,d<V_4 C_2),AND(d>V_5 C_1,d<V_5 C_2),AND(d>V_6 C_1,d<V_6 C_2)),d,0)","v":0},0,0]
[null,null,null,null,null,null,null,null,"2016-06-01",null,{"$f":"IF(OR(AND(d>V_1 A_1,d<V_1 A_2),AND(d>V_2 A_1,d<V_2 A_2),AND(d>V_3 A_1,d<V_3 A_2),AND(d>V_4 A_1,d<V_4 A_2),AND(d>V_5 A_1,d<V_5 A_2),AND(d>V_6 A_1,d<V_6 A_2)),d,0)","v":0},{"$f":"IF(OR(AND(d>V_1 B_1,d<V_1 B_2),AND(d>V_2 B_1,d<V_2 B_2),AND(d>V_3 B_1,d<V_3 B_2),AND(d>V_4 B_1,d<V_4 B_2),AND(d>V_5 B_1,d<V_5 B_2),AND(d>V_6 B_1,d<V_6 B_2)),d,0)","v":0},{"$f":"IF(OR(AND(d>V_1 C_1,d<V_1 C_2),AND(d>V_2 C_1,d<V_2 C_2),AND(d>V_3 C_1,d<V_3 C_2),AND(d>V_4 C_1,d<V_4 C_2),AND(d>V_5 C_1,d<V_5 C_2),AND(d>V_6 C_1,d<V_6 C_2)),d,0)","v":0},0,0]
[null,null,null,null,null,null,null,null,"2016-06-02",null,{"$f":"IF(OR(AND(d>V_1 A_1,d<V_1 A_2),AND(d>V_2 A_1,d<V_2 A_2),AND(d>V_3 A_1,d<V_3 A_2),AND(d>V_4 A_1,d<V_4 A_2),AND(d>V_5 A_1,d<V_5 A_2),AND(d>V_6 A_1,d<V_6 A_2)),d,0)","v":0},{"$f":"IF(OR(AND(d>V_1 B_1,d<V_1 B_2),AND(d>V_2 B_1,d<V_2 B_2),AND(d>V_3 B_1,d<V_3 B_2),AND(d>V_4 B_1,d<V_4 B_2),AND(d>V_5 B_1,d<V_5 B_2),AND(d>V_6 B_1,d<V_6 B_2)),d,0)","v":0},{"$f":"IF(OR(AND(d>V_1 C_1,d<V_1 C_2),AND(d>V_2 C_1,d<V_2 C_2),AND(d>V_3 C_1,d<V_3 C_2),AND(d>V_4 C_1,d<V_4 C_2),AND(d>V_5 C_1,d<V_5 C_2),AND(d>V_6 C_1,d<V_6 C_2)),d,0)","v":0},0,0]
[null,null,null,null,null,null,null,null,"2016-06-03",null,{"$f":"IF(OR(AND(d>V_1 A_1,d<V_1 A_2),AND(d>V_2 A_1,d<V_2 A_2),AND(d>V_3 A_1,d<V_3 A_2),AND(d>V_4 A_1,d<V_4 A_2),AND(d>V_5 A_1,d<V_5 A_2),AND(d>V_6 A_1,d<V_6 A_2)),d,0)","v":0},{"$f":"IF(OR(AND(d>V_1 B_1,d<V_1 B_2),AND(d>V_2 B_1,d<V_2 B_2),AND(d>V_3 B_1,d<V_3 B_2),AND(d>V_4 B_1,d<V_4 B_2),AND(d>V_5 B_1,d<V_5 B_2),AND(d>V_6 B_1,d<V_6 B_2)),d,0)","v":0},{"$f":"IF(OR(AND(d>V_1 C_1,d<V_1 C_2),AND(d>V_2 C_1,d<V_2 C_2),AND(d>V_3 C_1,d<V_3 C_2),AND(d>V_4 C_1,d<V_4 C_2),AND(d>V_5 C_1,d<V_5 C_2),AND(d>V_6 C_1,d<V_6 C_2)),d,0)","v":0},0,0]
[null,null,null,null,null,null,null,null,"2016-06-04",null,{"$f":"IF(OR(AND(d>V_1 A_1,d<V_1 A_2),AND(d>V_2 A_1,d<V_2 A_2),AND(d>V_3 A_1,d<V_3 A_2),AND(d>V_4 A_1,d<V_4 A_2),AND(d>V_5 A_1,d<V_5 A_2),AND(d>V_6 A_1,d<V_6 A_2)),d,0)","v":0},{"$f":"IF(OR(AND(d>V_1 B_1,d<V_1 B_2),AND(d>V_2 B_1,d<V_2 B_2),AND(d>V_3 B_1,d<V_3 B_2),AND(d>V_4 B_1,d<V_4 B_2),AND(d>V_5 B_1,d<V_5 B_2),AND(d>V_6 B_1,d<V_6 B_2)),d,0)","v":0},{"$f":"IF(OR(AND(d>V_1 C_1,d<V_1 C_2),AND(d>V_2 C_1,d<V_2 C_2),AND(d>V_3 C_1,d<V_3 C_2),AND(d>V_4 C_1,d<V_4 C_2),AND(d>V_5 C_1,d<V_5 C_2),AND(d>V_6 C_1,d<V_6 C_2)),d,0)","v":0},0,0]
[null,null,null,null,null,null,null,null,"2016-06-05",null,{"$f":"IF(OR(AND(d>V_1 A_1,d<V_1 A_2),AND(d>V_2 A_1,d<V_2 A_2),AND(d>V_3 A_1,d<V_3 A_2),AND(d>V_4 A_1,d<V_4 A_2),AND(d>V_5 A_1,d<V_5 A_2),AND(d>V_6 A_1,d<V_6 A_2)),d,0)","v":0},{"$f":"IF(OR(AND(d>V_1 B_1,d<V_1 B_2),AND(d>V_2 B_1,d<V_2 B_2),AND(d>V_3 B_1,d<V_3 B_2),AND(d>V_4 B_1,d<V_4 B_2),AND(d>V_5 B_1,d<V_5 B_2),AND(d>V_6 B_1,d<V_6 B_2)),d,0)","v":0},{"$f":"IF(OR(AND(d>V_1 C_1,d<V_1 C_2),AND(d>V_2 C_1,d<V_2 C_2),AND(d>V_3 C_1,d<V_3 C_2),AND(d>V_4 C_1,d<V_4 C_2),AND(d>V_5 C_1,d<V_5 C_2),AND(d>V_6 C_1,d<V_6 C_2)),d,0)","v":0},0,0]
[null,null,null,null,null,null,null,null,"2016-06-06",null,{"$f":"IF(OR(AND(d>V_1 A_1,d<V_1 A_2),AND(d>V_2 A_1,d<V_2 A_2),AND(d>V_3 A_1,d<V_3 A_2),AND(d>V_4 A_1,d<V_4 A_2),AND(d>V_5 A_1,d<V_5 A_2),AND(d>V_6 A_1,d<V_6 A_2)),d,0)","v":0},{"$f":"IF(OR(AND(d>V_1 B_1,d<V_1 B_2),AND(d>V_2 B_1,d<V_2 B_2),AND(d>V_3 B_1,d<V_3 B_2),AND(d>V_4 B_1,d<V_4 B_2),AND(d>V_5 B_1,d<V_5 B_2),AND(d>V_6 B_1,d<V_6 B_2)),d,0)","v":0},{"$f":"IF(OR(AND(d>V_1 C_1,d<V_1 C_2),AND(d>V_2 C_1,d<V_2 C_2),AND(d>V_3 C_1,d<V_3 C_2),AND(d>V_4 C_1,d<V_4 C_2),AND(d>V_5 C_1,d<V_5 C_2),AND(d>V_6 C_1,d<V_6 C_2)),d,0)","v":0},0,0]
[null,null,null,null,null,null,null,null,"2016-06-07",null,{"$f":"IF(OR(AND(d>V_1 A_1,d<V_1 A_2),AND(d>V_2 A_1,d<V_2 A_2),AND(d>V_3 A_1,d<V_3 A_2),AND(d>V_4 A_1,d<V_4 A_2),AND(d>V_5 A_1,d<V_5 A_2),AND(d>V_6 A_1,d<V_6 A_2)),d,0)","v":0},{"$f":"IF(OR(AND(d>V_1 B_1,d<V_1 B_2),AND(d>V_2 B_1,d<V_2 B_2),AND(d>V_3 B_1,d<V_3 B_2),AND(d>V_4 B_1,d<V_4 B_2),AND(d>V_5 B_1,d<V_5 B_2),AND(d>V_6 B_1,d<V_6 B_2)),d,0)","v":0},{"$f":"IF(OR(AND(d>V_1 C_1,d<V_1 C_2),AND(d>V_2 C_1,d<V_2 C_2),AND(d>V_3 C_1,d<V_3 C_2),AND(d>V_4 C_1,d<V_4 C_2),AND(d>V_5 C_1,d<V_5 C_2),AND(d>V_6 C_1,d<V_6 C_2)),d,0)","v":0},0,0]
[null,null,null,null,null,null,null,null,"2016-06-08",null,{"$f":"IF(OR(AND(d>V_1 A_1,d<V_1 A_2),AND(d>V_2 A_1,d<V_2 A_2),AND(d>V_3 A_1,d<V_3 A_2),AND(d>V_4 A_1,d<V_4 A_2),AND(d>V_5 A_1,d<V_5 A_2),AND(d>V_6 A_1,d<V_6 A_2)),d,0)","v":0},{"$f":"IF(OR(AND(d>V_1 B_1,d<V_1 B_2),AND(d>V_2 B_1,d<V_2 B_2),AND(d>V_3 B_1,d<V_3 B_2),AND(d>V_4 B_1,d<V_4 B_2),AND(d>V_5 B_1,d<V_5 B_2),AND(d>V_6 B_1,d<V_6 B_2)),d,0)","v":0},{"$f":"IF(OR(AND(d>V_1 C_1,d<V_1 C_2),AND(d>V_2 C_1,d<V_2 C_2),AND(d>V_3 C_1,d<V_3 C_2),AND(d>V_4 C_1,d<V_4 C_2),AND(d>V_5 C_1,d<V_5 C_2),AND(d>V_6 C_1,d<V_6 C_2)),d,0)","v":0},0,0]
[null,null,null,null,null,null,null,null,"2016-06-09",null,{"$f":"IF(OR(AND(d>V_1 A_1,d<V_1 A_2),AND(d>V_2 A_1,d<V_2 A_2),AND(d>V_3 A_1,d<V_3 A_2),AND(d>V_4 A_1,d<V_4 A_2),AND(d>V_5 A_1,d<V_5 A_2),AND(d>V_6 A_1,d<V_6 A_2)),d,0)","v":0},{"$f":"IF(OR(AND(d>V_1 B_1,d<V_1 B_2),AND(d>V_2 B_1,d<V_2 B_2),AND(d>V_3 B_1,d<V_3 B_2),AND(d>V_4 B_1,d<V_4 B_2),AND(d>V_5 B_1,d<V_5 B_2),AND(d>V_6 B_1,d<V_6 B_2)),d,0)","v":0},{"$f":"IF(OR(AND(d>V_1 C_1,d<V_1 C_2),AND(d>V_2 C_1,d<V_2 C_2),AND(d>V_3 C_1,d<V_3 C_2),AND(d>V_4 C_1,d<V_4 C_2),AND(d>V_5 C_1,d<V_5 C_2),AND(d>V_6 C_1,d<V_6 C_2)),d,0)","v":0},0,0]
[null,null,null,null,null,null,null,null,"2016-06-10",null,{"$f":"IF(OR(AND(d>V_1 A_1,d<V_1 A_2),AND(d>V_2 A_1,d<V_2 A_2),AND(d>V_3 A_1,d<V_3 A_2),AND(d>V_4 A_1,d<V_4 A_2),AND(d>V_5 A_1,d<V_5 A_2),AND(d>V_6 A_1,d<V_6 A_2)),d,0)","v":0},{"$f":"IF(OR(AND(d>V_1 B_1,d<V_1 B_2),AND(d>V_2 B_1,d<V_2 B_2),AND(d>V_3 B_1,d<V_3 B_2),AND(d>V_4 B_1,d<V_4 B_2),AND(d>V_5 B_1,d<V_5 B_2),AND(d>V_6 B_1,d<V_6 B_2)),d,0)","v":0},{"$f":"IF(OR(AND(d>V_1 C_1,d<V_1 C_2),AND(d>V_2 C_1,d<V_2 C_2),AND(d>V_3 C_1,d<V_3 C_2),AND(d>V_4 C_1,d<V_4 C_2),AND(d>V_5 C_1,d<V_5 C_2),AND(d>V_6 C_1,d<V_6 C_2)),d,0)","v":0},0,0]
[null,null,null,null,null,null,null,null,"2016-06-11",null,{"$f":"IF(OR(AND(d>V_1 A_1,d<V_1 A_2),AND(d>V_2 A_1,d<V_2 A_2),AND(d>V_3 A_1,d<V_3 A_2),AND(d>V_4 A_1,d<V_4 A_2),AND(d>V_5 A_1,d<V_5 A_2),AND(d>V_6 A_1,d<V_6 A_2)),d,0)","v":0},{"$f":"IF(OR(AND(d>V_1 B_1,d<V_1 B_2),AND(d>V_2 B_1,d<V_2 B_2),AND(d>V_3 B_1,d<V_3 B_2),AND(d>V_4 B_1,d<V_4 B_2),AND(d>V_5 B_1,d<V_5 B_2),AND(d>V_6 B_1,d<V_6 B_2)),d,0)","v":0},{"$f":"IF(OR(AND(d>V_1 C_1,d<V_1 C_2),AND(d>V_2 C_1,d<V_2 C_2),AND(d>V_3 C_1,d<V_3 C_2),AND(d>V_4 C_1,d<V_4 C_2),AND(d>V_5 C_1,d<V_5 C_2),AND(d>V_6 C_1,d<V_6 C_2)),d,0)","v":0},0,0]
[null,null,null,null,null,null,null,null,"2016-06-12",null,{"$f":"IF(OR(AND(d>V_1 A_1,d<V_1 A_2),AND(d>V_2 A_1,d<V_2 A_2),AND(d>V_3 A_1,d<V_3 A_2),AND(d>V_4 A_1,d<V_4 A_2),AND(d>V_5 A_1,d<V_5 A_2),AND(d>V_6 A_1,d<V_6 A_2)),d,0)","v":0},{"$f":"IF(OR(AND(d>V_1 B_1,d<V_1 B_2),AND(d>V_2 B_1,d<V_2 B_2),AND(d>V_3 B_1,d<V_3 B_2),AND(d>V_4 B_1,d<V_4 B_2),AND(d>V_5 B_1,d<V_5 B_2),AND(d>V_6 B_1,d<V_6 B_2)),d,0)","v":0},{"$f":"IF(OR(AND(d>V_1 C_1,d<V_1 C_2),AND(d>V_2 C_1,d<V_2 C_2),AND(d>V_3 C_1,d<V_3 C_2),AND(d>V_4 C_1,d<V_4 C_2),AND(d>V_5 C_1,d<V_5 C_2),AND(d>V_6 C_1,d<V_6 C_2)),d,0)","v":0},0,0]
[null,null,null,null,null,null,null,null,"2016-06-13",null,{"$f":"IF(OR(AND(d>V_1 A_1,d<V_1 A_2),AND(d>V_2 A_1,d<V_2 A_2),AND(d>V_3 A_1,d<V_3 A_2),AND(d>V_4 A_1,d<V_4 A_2),AND(d>V_5 A_1,d<V_5 A_2),AND(d>V_6 A_1,d<V_6 A_2)),d,0)","v":0},{"$f":"IF(OR(AND(d>V_1 B_1,d<V_1 B_2),AND(d>V_2 B_1,d<V_2 B_2),AND(d>V_3 B_1,d<V_3 B_2),AND(d>V_4 B_1,d<V_4 B_2),AND(d>V_5 B_1,d<V_5 B_2),AND(d>V_6 B_1,d<V_6 B_2)),d,0)","v":0},{"$f":"IF(OR(AND(d>V_1 C_1,d<V_1 C_2),AND(d>V_2 C_1,d<V_2 C_2),AND(d>V_3 C_1,d<V_3 C_2),AND(d>V_4 C_1,d<V_4 C_2),AND(d>V_5 C_1,d<V_5 C_2),AND(d>V_6 C_1,d<V_6 C_2)),d,0)","v":0},0,0]
[null,null,null,null,null,null,null,null,"2016-06-14",null,{"$f":"IF(OR(AND(d>V_1 A_1,d<V_1 A_2),AND(d>V_2 A_1,d<V_2 A_2),AND(d>V_3 A_1,d<V_3 A_2),AND(d>V_4 A_1,d<V_4 A_2),AND(d>V_5 A_1,d<V_5 A_2),AND(d>V_6 A_1,d<V_6 A_2)),d,0)","v":0},{"$f":"IF(OR(AND(d>V_1 B_1,d<V_1 B_2),AND(d>V_2 B_1,d<V_2 B_2),AND(d>V_3 B_1,d<V_3 B_2),AND(d>V_4 B_1,d<V_4 B_2),AND(d>V_5 B_1,d<V_5 B_2),AND(d>V_6 B_1,d<V_6 B_2)),d,0)","v":0},{"$f":"IF(OR(AND(d>V_1 C_1,d<V_1 C_2),AND(d>V_2 C_1,d<V_2 C_2),AND(d>V_3 C_1,d<V_3 C_2),AND(d>V_4 C_1,d<V_4 C_2),AND(d>V_5 C_1,d<V_5 C_2),AND(d>V_6 C_1,d<V_6 C_2)),d,0)","v":0},0,0]
[null,null,null,null,null,null,null,null,"2016-06-15",null,{"$f":"IF(OR(AND(d>V_1 A_1,d<V_1 A_2),AND(d>V_2 A_1,d<V_2 A_2),AND(d>V_3 A_1,d<V_3 A_2),AND(d>V_4 A_1,d<V_4 A_2),AND(d>V_5 A_1,d<V_5 A_2),AND(d>V_6 A_1,d<V_6 A_2)),d,0)","v":0},{"$f":"IF(OR(AND(d>V_1 B_1,d<V_1 B_2),AND(d>V_2 B_1,d<V_2 B_2),AND(d>V_3 B_1,d<V_3 B_2),AND(d>V_4 B_1,d<V_4 B_2),AND(d>V_5 B_1,d<V_5 B_2),AND(d>V_6 B_1,d<V_6 B_2)),d,0)","v":0},{"$f":"IF(OR(AND(d>V_1 C_1,d<V_1 C_2),AND(d>V_2 C_1,d<V_2 C_2),AND(d>V_3 C_1,d<V_3 C_2),AND(d>V_4 C_1,d<V_4 C_2),AND(d>V_5 C_1,d<V_5 C_2),AND(d>V_6 C_1,d<V_6 C_2)),d,0)","v":0},0,0]
[null,null,null,null,null,null,null,null,"2016-06-16",null,{"$f":"IF(OR(AND(d>V_1 A_1,d<V_1 A_2),AND(d>V_2 A_1,d<V_2 A_2),AND(d>V_3 A_1,d<V_3 A_2),AND(d>V_4 A_1,d<V_4 A_2),AND(d>V_5 A_1,d<V_5 A_2),AND(d>V_6 A_1,d<V_6 A_2)),d,0)","v":0},{"$f":"IF(OR(AND(d>V_1 B_1,d<V_1 B_2),AND(d>V_2 B_1,d<V_2 B_2),AND(d>V_3 B_1,d<V_3 B_2),AND(d>V_4 B_1,d<V_4 B_2),AND(d>V_5 B_1,d<V_5 B_2),AND(d>V_6 B_1,d<V_6 B_2)),d,0)","v":0},{"$f":"IF(OR(AND(d>V_1 C_1,d<V_1 C_2),AND(d>V_2 C_1,d<V_2 C_2),AND(d>V_3 C_1,d<V_3 C_2),AND(d>V_4 C_1,d<V_4 C_2),AND(d>V_5 C_1,d<V_5 C_2),AND(d>V_6 C_1,d<V_6 C_2)),d,0)","v":0},0,0]
[null,null,null,null,null,null,null,null,"2016-06-17",null,{"$f":"IF(OR(AND(d>V_1 A_1,d<V_1 A_2),AND(d>V_2 A_1,d<V_2 A_2),AND(d>V_3 A_1,d<V_3 A_2),AND(d>V_4 A_1,d<V_4 A_2),AND(d>V_5 A_1,d<V_5 A_2),AND(d>V_6 A_1,d<V_6 A_2)),d,0)","v":0},{"$f":"IF(OR(AND(d>V_1 B_1,d<V_1 B_2),AND(d>V_2 B_1,d<V_2 B_2),AND(d>V_3 B_1,d<V_3 B_2),AND(d>V_4 B_1,d<V_4 B_2),AND(d>V_5 B_1,d<V_5 B_2),AND(d>V_6 B_1,d<V_6 B_2)),d,0)","v":0},{"$f":"IF(OR(AND(d>V_1 C_1,d<V_1 C_2),AND(d>V_2 C_1,d<V_2 C_2),AND(d>V_3 C_1,d<V_3 C_2),AND(d>V_4 C_1,d<V_4 C_2),AND(d>V_5 C_1,d<V_5 C_2),AND(d>V_6 C_1,d<V_6 C_2)),d,0)","v":0},0,0]
[null,null,null,null,null,null,null,null,{"$f":"I359+1","v":"2016-06-18"},null,{"$f":"IF(OR(AND(d>V_1 A_1,d<V_1 A_2),AND(d>V_2 A_1,d<V_2 A_2),AND(d>V_3 A_1,d<V_3 A_2),AND(d>V_4 A_1,d<V_4 A_2),AND(d>V_5 A_1,d<V_5 A_2),AND(d>V_6 A_1,d<V_6 A_2)),d,0)","v":0},{"$f":"IF(OR(AND(d>V_1 B_1,d<V_1 B_2),AND(d>V_2 B_1,d<V_2 B_2),AND(d>V_3 B_1,d<V_3 B_2),AND(d>V_4 B_1,d<V_4 B_2),AND(d>V_5 B_1,d<V_5 B_2),AND(d>V_6 B_1,d<V_6 B_2)),d,0)","v":0},{"$f":"IF(OR(AND(d>V_1 C_1,d<V_1 C_2),AND(d>V_2 C_1,d<V_2 C_2),AND(d>V_3 C_1,d<V_3 C_2),AND(d>V_4 C_1,d<V_4 C_2),AND(d>V_5 C_1,d<V_5 C_2),AND(d>V_6 C_1,d<V_6 C_2)),d,0)","v":0},{"$f":"MAX(K360:M360)","v":0},{"$f":"INDEX(J360:N360,choix_zone)","v":0}]
[null,null,null,null,null,null,null,null,"2016-06-19",null,{"$f":"IF(OR(AND(d>V_1 A_1,d<V_1 A_2),AND(d>V_2 A_1,d<V_2 A_2),AND(d>V_3 A_1,d<V_3 A_2),AND(d>V_4 A_1,d<V_4 A_2),AND(d>V_5 A_1,d<V_5 A_2),AND(d>V_6 A_1,d<V_6 A_2)),d,0)","v":0},{"$f":"IF(OR(AND(d>V_1 B_1,d<V_1 B_2),AND(d>V_2 B_1,d<V_2 B_2),AND(d>V_3 B_1,d<V_3 B_2),AND(d>V_4 B_1,d<V_4 B_2),AND(d>V_5 B_1,d<V_5 B_2),AND(d>V_6 B_1,d<V_6 B_2)),d,0)","v":0},{"$f":"IF(OR(AND(d>V_1 C_1,d<V_1 C_2),AND(d>V_2 C_1,d<V_2 C_2),AND(d>V_3 C_1,d<V_3 C_2),AND(d>V_4 C_1,d<V_4 C_2),AND(d>V_5 C_1,d<V_5 C_2),AND(d>V_6 C_1,d<V_6 C_2)),d,0)","v":0},0,0]
[null,null,null,null,null,null,null,null,"2016-06-20",null,{"$f":"IF(OR(AND(d>V_1 A_1,d<V_1 A_2),AND(d>V_2 A_1,d<V_2 A_2),AND(d>V_3 A_1,d<V_3 A_2),AND(d>V_4 A_1,d<V_4 A_2),AND(d>V_5 A_1,d<V_5 A_2),AND(d>V_6 A_1,d<V_6 A_2)),d,0)","v":0},{"$f":"IF(OR(AND(d>V_1 B_1,d<V_1 B_2),AND(d>V_2 B_1,d<V_2 B_2),AND(d>V_3 B_1,d<V_3 B_2),AND(d>V_4 B_1,d<V_4 B_2),AND(d>V_5 B_1,d<V_5 B_2),AND(d>V_6 B_1,d<V_6 B_2)),d,0)","v":0},{"$f":"IF(OR(AND(d>V_1 C_1,d<V_1 C_2),AND(d>V_2 C_1,d<V_2 C_2),AND(d>V_3 C_1,d<V_3 C_2),AND(d>V_4 C_1,d<V_4 C_2),AND(d>V_5 C_1,d<V_5 C_2),AND(d>V_6 C_1,d<V_6 C_2)),d,0)","v":0},0,0]
[null,null,null,null,null,null,null,null,"2016-06-21",null,{"$f":"IF(OR(AND(d>V_1 A_1,d<V_1 A_2),AND(d>V_2 A_1,d<V_2 A_2),AND(d>V_3 A_1,d<V_3 A_2),AND(d>V_4 A_1,d<V_4 A_2),AND(d>V_5 A_1,d<V_5 A_2),AND(d>V_6 A_1,d<V_6 A_2)),d,0)","v":0},{"$f":"IF(OR(AND(d>V_1 B_1,d<V_1 B_2),AND(d>V_2 B_1,d<V_2 B_2),AND(d>V_3 B_1,d<V_3 B_2),AND(d>V_4 B_1,d<V_4 B_2),AND(d>V_5 B_1,d<V_5 B_2),AND(d>V_6 B_1,d<V_6 B_2)),d,0)","v":0},{"$f":"IF(OR(AND(d>V_1 C_1,d<V_1 C_2),AND(d>V_2 C_1,d<V_2 C_2),AND(d>V_3 C_1,d<V_3 C_2),AND(d>V_4 C_1,d<V_4 C_2),AND(d>V_5 C_1,d<V_5 C_2),AND(d>V_6 C_1,d<V_6 C_2)),d,0)","v":0},0,0]
[null,null,null,null,null,null,null,null,"2016-06-22",null,{"$f":"IF(OR(AND(d>V_1 A_1,d<V_1 A_2),AND(d>V_2 A_1,d<V_2 A_2),AND(d>V_3 A_1,d<V_3 A_2),AND(d>V_4 A_1,d<V_4 A_2),AND(d>V_5 A_1,d<V_5 A_2),AND(d>V_6 A_1,d<V_6 A_2)),d,0)","v":0},{"$f":"IF(OR(AND(d>V_1 B_1,d<V_1 B_2),AND(d>V_2 B_1,d<V_2 B_2),AND(d>V_3 B_1,d<V_3 B_2),AND(d>V_4 B_1,d<V_4 B_2),AND(d>V_5 B_1,d<V_5 B_2),AND(d>V_6 B_1,d<V_6 B_2)),d,0)","v":0},{"$f":"IF(OR(AND(d>V_1 C_1,d<V_1 C_2),AND(d>V_2 C_1,d<V_2 C_2),AND(d>V_3 C_1,d<V_3 C_2),AND(d>V_4 C_1,d<V_4 C_2),AND(d>V_5 C_1,d<V_5 C_2),AND(d>V_6 C_1,d<V_6 C_2)),d,0)","v":0},0,0]
[null,null,null,null,null,null,null,null,"2016-06-23",null,{"$f":"IF(OR(AND(d>V_1 A_1,d<V_1 A_2),AND(d>V_2 A_1,d<V_2 A_2),AND(d>V_3 A_1,d<V_3 A_2),AND(d>V_4 A_1,d<V_4 A_2),AND(d>V_5 A_1,d<V_5 A_2),AND(d>V_6 A_1,d<V_6 A_2)),d,0)","v":0},{"$f":"IF(OR(AND(d>V_1 B_1,d<V_1 B_2),AND(d>V_2 B_1,d<V_2 B_2),AND(d>V_3 B_1,d<V_3 B_2),AND(d>V_4 B_1,d<V_4 B_2),AND(d>V_5 B_1,d<V_5 B_2),AND(d>V_6 B_1,d<V_6 B_2)),d,0)","v":0},{"$f":"IF(OR(AND(d>V_1 C_1,d<V_1 C_2),AND(d>V_2 C_1,d<V_2 C_2),AND(d>V_3 C_1,d<V_3 C_2),AND(d>V_4 C_1,d<V_4 C_2),AND(d>V_5 C_1,d<V_5 C_2),AND(d>V_6 C_1,d<V_6 C_2)),d,0)","v":0},0,0]
[null,null,null,null,null,null,null,null,"2016-06-24",null,{"$f":"IF(OR(AND(d>V_1 A_1,d<V_1 A_2),AND(d>V_2 A_1,d<V_2 A_2),AND(d>V_3 A_1,d<V_3 A_2),AND(d>V_4 A_1,d<V_4 A_2),AND(d>V_5 A_1,d<V_5 A_2),AND(d>V_6 A_1,d<V_6 A_2)),d,0)","v":0},{"$f":"IF(OR(AND(d>V_1 B_1,d<V_1 B_2),AND(d>V_2 B_1,d<V_2 B_2),AND(d>V_3 B_1,d<V_3 B_2),AND(d>V_4 B_1,d<V_4 B_2),AND(d>V_5 B_1,d<V_5 B_2),AND(d>V_6 B_1,d<V_6 B_2)),d,0)","v":0},{"$f":"IF(OR(AND(d>V_1 C_1,d<V_1 C_2),AND(d>V_2 C_1,d<V_2 C_2),AND(d>V_3 C_1,d<V_3 C_2),AND(d>V_4 C_1,d<V_4 C_2),AND(d>V_5 C_1,d<V_5 C_2),AND(d>V_6 C_1,d<V_6 C_2)),d,0)","v":0},0,0]
[null,null,null,null,null,null,null,null,"2016-06-25",null,{"$f":"IF(OR(AND(d>V_1 A_1,d<V_1 A_2),AND(d>V_2 A_1,d<V_2 A_2),AND(d>V_3 A_1,d<V_3 A_2),AND(d>V_4 A_1,d<V_4 A_2),AND(d>V_5 A_1,d<V_5 A_2),AND(d>V_6 A_1,d<V_6 A_2)),d,0)","v":0},{"$f":"IF(OR(AND(d>V_1 B_1,d<V_1 B_2),AND(d>V_2 B_1,d<V_2 B_2),AND(d>V_3 B_1,d<V_3 B_2),AND(d>V_4 B_1,d<V_4 B_2),AND(d>V_5 B_1,d<V_5 B_2),AND(d>V_6 B_1,d<V_6 B_2)),d,0)","v":0},{"$f":"IF(OR(AND(d>V_1 C_1,d<V_1 C_2),AND(d>V_2 C_1,d<V_2 C_2),AND(d>V_3 C_1,d<V_3 C_2),AND(d>V_4 C_1,d<V_4 C_2),AND(d>V_5 C_1,d<V_5 C_2),AND(d>V_6 C_1,d<V_6 C_2)),d,0)","v":0},0,0]
[null,null,null,null,null,null,null,null,"2016-06-26",null,{"$f":"IF(OR(AND(d>V_1 A_1,d<V_1 A_2),AND(d>V_2 A_1,d<V_2 A_2),AND(d>V_3 A_1,d<V_3 A_2),AND(d>V_4 A_1,d<V_4 A_2),AND(d>V_5 A_1,d<V_5 A_2),AND(d>V_6 A_1,d<V_6 A_2)),d,0)","v":0},{"$f":"IF(OR(AND(d>V_1 B_1,d<V_1 B_2),AND(d>V_2 B_1,d<V_2 B_2),AND(d>V_3 B_1,d<V_3 B_2),AND(d>V_4 B_1,d<V_4 B_2),AND(d>V_5 B_1,d<V_5 B_2),AND(d>V_6 B_1,d<V_6 B_2)),d,0)","v":0},{"$f":"IF(OR(AND(d>V_1 C_1,d<V_1 C_2),AND(d>V_2 C_1,d<V_2 C_2),AND(d>V_3 C_1,d<V_3 C_2),AND(d>V_4 C_1,d<V_4 C_2),AND(d>V_5 C_1,d<V_5 C_2),AND(d>V_6 C_1,d<V_6 C_2)),d,0)","v":0},0,0]
[null,null,null,null,null,null,null,null,{"$f":"I368+1","v":"2016-06-27"},null,{"$f":"IF(OR(AND(d>V_1 A_1,d<V_1 A_2),AND(d>V_2 A_1,d<V_2 A_2),AND(d>V_3 A_1,d<V_3 A_2),AND(d>V_4 A_1,d<V_4 A_2),AND(d>V_5 A_1,d<V_5 A_2),AND(d>V_6 A_1,d<V_6 A_2)),d,0)","v":0},{"$f":"IF(OR(AND(d>V_1 B_1,d<V_1 B_2),AND(d>V_2 B_1,d<V_2 B_2),AND(d>V_3 B_1,d<V_3 B_2),AND(d>V_4 B_1,d<V_4 B_2),AND(d>V_5 B_1,d<V_5 B_2),AND(d>V_6 B_1,d<V_6 B_2)),d,0)","v":0},{"$f":"IF(OR(AND(d>V_1 C_1,d<V_1 C_2),AND(d>V_2 C_1,d<V_2 C_2),AND(d>V_3 C_1,d<V_3 C_2),AND(d>V_4 C_1,d<V_4 C_2),AND(d>V_5 C_1,d<V_5 C_2),AND(d>V_6 C_1,d<V_6 C_2)),d,0)","v":0},{"$f":"MAX(K369:M369)","v":0},{"$f":"INDEX(J369:N369,choix_zone)","v":0}]
[null,null,null,null,null,null,null,null,"2016-06-28",null,{"$f":"IF(OR(AND(d>V_1 A_1,d<V_1 A_2),AND(d>V_2 A_1,d<V_2 A_2),AND(d>V_3 A_1,d<V_3 A_2),AND(d>V_4 A_1,d<V_4 A_2),AND(d>V_5 A_1,d<V_5 A_2),AND(d>V_6 A_1,d<V_6 A_2)),d,0)","v":0},{"$f":"IF(OR(AND(d>V_1 B_1,d<V_1 B_2),AND(d>V_2 B_1,d<V_2 B_2),AND(d>V_3 B_1,d<V_3 B_2),AND(d>V_4 B_1,d<V_4 B_2),AND(d>V_5 B_1,d<V_5 B_2),AND(d>V_6 B_1,d<V_6 B_2)),d,0)","v":0},{"$f":"IF(OR(AND(d>V_1 C_1,d<V_1 C_2),AND(d>V_2 C_1,d<V_2 C_2),AND(d>V_3 C_1,d<V_3 C_2),AND(d>V_4 C_1,d<V_4 C_2),AND(d>V_5 C_1,d<V_5 C_2),AND(d>V_6 C_1,d<V_6 C_2)),d,0)","v":0},0,0]
[null,null,null,null,null,null,null,null,"2016-06-29",null,{"$f":"IF(OR(AND(d>V_1 A_1,d<V_1 A_2),AND(d>V_2 A_1,d<V_2 A_2),AND(d>V_3 A_1,d<V_3 A_2),AND(d>V_4 A_1,d<V_4 A_2),AND(d>V_5 A_1,d<V_5 A_2),AND(d>V_6 A_1,d<V_6 A_2)),d,0)","v":0},{"$f":"IF(OR(AND(d>V_1 B_1,d<V_1 B_2),AND(d>V_2 B_1,d<V_2 B_2),AND(d>V_3 B_1,d<V_3 B_2),AND(d>V_4 B_1,d<V_4 B_2),AND(d>V_5 B_1,d<V_5 B_2),AND(d>V_6 B_1,d<V_6 B_2)),d,0)","v":0},{"$f":"IF(OR(AND(d>V_1 C_1,d<V_1 C_2),AND(d>V_2 C_1,d<V_2 C_2),AND(d>V_3 C_1,d<V_3 C_2),AND(d>V_4 C_1,d<V_4 C_2),AND(d>V_5 C_1,d<V_5 C_2),AND(d>V_6 C_1,d<V_6 C_2)),d,0)","v":0},0,0]
[null,null,null,null,null,null,null,null,"2016-06-30",null,{"$f":"IF(OR(AND(d>V_1 A_1,d<V_1 A_2),AND(d>V_2 A_1,d<V_2 A_2),AND(d>V_3 A_1,d<V_3 A_2),AND(d>V_4 A_1,d<V_4 A_2),AND(d>V_5 A_1,d<V_5 A_2),AND(d>V_6 A_1,d<V_6 A_2)),d,0)","v":0},{"$f":"IF(OR(AND(d>V_1 B_1,d<V_1 B_2),AND(d>V_2 B_1,d<V_2 B_2),AND(d>V_3 B_1,d<V_3 B_2),AND(d>V_4 B_1,d<V_4 B_2),AND(d>V_5 B_1,d<V_5 B_2),AND(d>V_6 B_1,d<V_6 B_2)),d,0)","v":0},{"$f":"IF(OR(AND(d>V_1 C_1,d<V_1 C_2),AND(d>V_2 C_1,d<V_2 C_2),AND(d>V_3 C_1,d<V_3 C_2),AND(d>V_4 C_1,d<V_4 C_2),AND(d>V_5 C_1,d<V_5 C_2),AND(d>V_6 C_1,d<V_6 C_2)),d,0)","v":0},0,0]
[null,null,null,null,null,null,null,null,"2016-07-01",null,{"$f":"IF(OR(AND(d>V_1 A_1,d<V_1 A_2),AND(d>V_2 A_1,d<V_2 A_2),AND(d>V_3 A_1,d<V_3 A_2),AND(d>V_4 A_1,d<V_4 A_2),AND(d>V_5 A_1,d<V_5 A_2),AND(d>V_6 A_1,d<V_6 A_2)),d,0)","v":0},{"$f":"IF(OR(AND(d>V_1 B_1,d<V_1 B_2),AND(d>V_2 B_1,d<V_2 B_2),AND(d>V_3 B_1,d<V_3 B_2),AND(d>V_4 B_1,d<V_4 B_2),AND(d>V_5 B_1,d<V_5 B_2),AND(d>V_6 B_1,d<V_6 B_2)),d,0)","v":0},{"$f":"IF(OR(AND(d>V_1 C_1,d<V_1 C_2),AND(d>V_2 C_1,d<V_2 C_2),AND(d>V_3 C_1,d<V_3 C_2),AND(d>V_4 C_1,d<V_4 C_2),AND(d>V_5 C_1,d<V_5 C_2),AND(d>V_6 C_1,d<V_6 C_2)),d,0)","v":0},0,0]
[null,null,null,null,null,null,null,null,"2016-07-02",null,{"$f":"IF(OR(AND(d>V_1 A_1,d<V_1 A_2),AND(d>V_2 A_1,d<V_2 A_2),AND(d>V_3 A_1,d<V_3 A_2),AND(d>V_4 A_1,d<V_4 A_2),AND(d>V_5 A_1,d<V_5 A_2),AND(d>V_6 A_1,d<V_6 A_2)),d,0)","v":0},{"$f":"IF(OR(AND(d>V_1 B_1,d<V_1 B_2),AND(d>V_2 B_1,d<V_2 B_2),AND(d>V_3 B_1,d<V_3 B_2),AND(d>V_4 B_1,d<V_4 B_2),AND(d>V_5 B_1,d<V_5 B_2),AND(d>V_6 B_1,d<V_6 B_2)),d,0)","v":0},{"$f":"IF(OR(AND(d>V_1 C_1,d<V_1 C_2),AND(d>V_2 C_1,d<V_2 C_2),AND(d>V_3 C_1,d<V_3 C_2),AND(d>V_4 C_1,d<V_4 C_2),AND(d>V_5 C_1,d<V_5 C_2),AND(d>V_6 C_1,d<V_6 C_2)),d,0)","v":0},0,0]
[null,null,null,null,null,null,null,null,"2016-07-03",null,{"$f":"IF(OR(AND(d>V_1 A_1,d<V_1 A_2),AND(d>V_2 A_1,d<V_2 A_2),AND(d>V_3 A_1,d<V_3 A_2),AND(d>V_4 A_1,d<V_4 A_2),AND(d>V_5 A_1,d<V_5 A_2),AND(d>V_6 A_1,d<V_6 A_2)),d,0)","v":0},{"$f":"IF(OR(AND(d>V_1 B_1,d<V_1 B_2),AND(d>V_2 B_1,d<V_2 B_2),AND(d>V_3 B_1,d<V_3 B_2),AND(d>V_4 B_1,d<V_4 B_2),AND(d>V_5 B_1,d<V_5 B_2),AND(d>V_6 B_1,d<V_6 B_2)),d,0)","v":0},{"$f":"IF(OR(AND(d>V_1 C_1,d<V_1 C_2),AND(d>V_2 C_1,d<V_2 C_2),AND(d>V_3 C_1,d<V_3 C_2),AND(d>V_4 C_1,d<V_4 C_2),AND(d>V_5 C_1,d<V_5 C_2),AND(d>V_6 C_1,d<V_6 C_2)),d,0)","v":0},0,0]
[null,null,null,null,null,null,null,null,{"$f":"I375+1","v":"2016-07-04"},null,{"$f":"IF(OR(AND(d>V_1 A_1,d<V_1 A_2),AND(d>V_2 A_1,d<V_2 A_2),AND(d>V_3 A_1,d<V_3 A_2),AND(d>V_4 A_1,d<V_4 A_2),AND(d>V_5 A_1,d<V_5 A_2),AND(d>V_6 A_1,d<V_6 A_2)),d,0)","v":0},{"$f":"IF(OR(AND(d>V_1 B_1,d<V_1 B_2),AND(d>V_2 B_1,d<V_2 B_2),AND(d>V_3 B_1,d<V_3 B_2),AND(d>V_4 B_1,d<V_4 B_2),AND(d>V_5 B_1,d<V_5 B_2),AND(d>V_6 B_1,d<V_6 B_2)),d,0)","v":0},{"$f":"IF(OR(AND(d>V_1 C_1,d<V_1 C_2),AND(d>V_2 C_1,d<V_2 C_2),AND(d>V_3 C_1,d<V_3 C_2),AND(d>V_4 C_1,d<V_4 C_2),AND(d>V_5 C_1,d<V_5 C_2),AND(d>V_6 C_1,d<V_6 C_2)),d,0)","v":0},{"$f":"MAX(K376:M376)","v":0},{"$f":"INDEX(J376:N376,choix_zone)","v":0}]
[null,null,null,null,null,null,null,null,"2016-07-05",null,{"$f":"IF(OR(AND(d>V_1 A_1,d<V_1 A_2),AND(d>V_2 A_1,d<V_2 A_2),AND(d>V_3 A_1,d<V_3 A_2),AND(d>V_4 A_1,d<V_4 A_2),AND(d>V_5 A_1,d<V_5 A_2),AND(d>V_6 A_1,d<V_6 A_2)),d,0)","v":0},{"$f":"IF(OR(AND(d>V_1 B_1,d<V_1 B_2),AND(d>V_2 B_1,d<V_2 B_2),AND(d>V_3 B_1,d<V_3 B_2),AND(d>V_4 B_1,d<V_4 B_2),AND(d>V_5 B_1,d<V_5 B_2),AND(d>V_6 B_1,d<V_6 B_2)),d,0)","v":0},{"$f":"IF(OR(AND(d>V_1 C_1,d<V_1 C_2),AND(d>V_2 C_1,d<V_2 C_2),AND(d>V_3 C_1,d<V_3 C_2),AND(d>V_4 C_1,d<V_4 C_2),AND(d>V_5 C_1,d<V_5 C_2),AND(d>V_6 C_1,d<V_6 C_2)),d,0)","v":0},0,0]
[null,null,null,null,null,null,null,null,"2016-07-06",null,{"$f":"IF(OR(AND(d>V_1 A_1,d<V_1 A_2),AND(d>V_2 A_1,d<V_2 A_2),AND(d>V_3 A_1,d<V_3 A_2),AND(d>V_4 A_1,d<V_4 A_2),AND(d>V_5 A_1,d<V_5 A_2),AND(d>V_6 A_1,d<V_6 A_2)),d,0)","v":42557},{"$f":"IF(OR(AND(d>V_1 B_1,d<V_1 B_2),AND(d>V_2 B_1,d<V_2 B_2),AND(d>V_3 B_1,d<V_3 B_2),AND(d>V_4 B_1,d<V_4 B_2),AND(d>V_5 B_1,d<V_5 B_2),AND(d>V_6 B_1,d<V_6 B_2)),d,0)","v":42557},{"$f":"IF(OR(AND(d>V_1 C_1,d<V_1 C_2),AND(d>V_2 C_1,d<V_2 C_2),AND(d>V_3 C_1,d<V_3 C_2),AND(d>V_4 C_1,d<V_4 C_2),AND(d>V_5 C_1,d<V_5 C_2),AND(d>V_6 C_1,d<V_6 C_2)),d,0)","v":42557},42557,42557]
[null,null,null,null,null,null,null,null,"2016-07-07",null,{"$f":"IF(OR(AND(d>V_1 A_1,d<V_1 A_2),AND(d>V_2 A_1,d<V_2 A_2),AND(d>V_3 A_1,d<V_3 A_2),AND(d>V_4 A_1,d<V_4 A_2),AND(d>V_5 A_1,d<V_5 A_2),AND(d>V_6 A_1,d<V_6 A_2)),d,0)","v":42558},{"$f":"IF(OR(AND(d>V_1 B_1,d<V_1 B_2),AND(d>V_2 B_1,d<V_2 B_2),AND(d>V_3 B_1,d<V_3 B_2),AND(d>V_4 B_1,d<V_4 B_2),AND(d>V_5 B_1,d<V_5 B_2),AND(d>V_6 B_1,d<V_6 B_2)),d,0)","v":42558},{"$f":"IF(OR(AND(d>V_1 C_1,d<V_1 C_2),AND(d>V_2 C_1,d<V_2 C_2),AND(d>V_3 C_1,d<V_3 C_2),AND(d>V_4 C_1,d<V_4 C_2),AND(d>V_5 C_1,d<V_5 C_2),AND(d>V_6 C_1,d<V_6 C_2)),d,0)","v":42558},42558,42558]
[null,null,null,null,null,null,null,null,"2016-07-08",null,{"$f":"IF(OR(AND(d>V_1 A_1,d<V_1 A_2),AND(d>V_2 A_1,d<V_2 A_2),AND(d>V_3 A_1,d<V_3 A_2),AND(d>V_4 A_1,d<V_4 A_2),AND(d>V_5 A_1,d<V_5 A_2),AND(d>V_6 A_1,d<V_6 A_2)),d,0)","v":42559},{"$f":"IF(OR(AND(d>V_1 B_1,d<V_1 B_2),AND(d>V_2 B_1,d<V_2 B_2),AND(d>V_3 B_1,d<V_3 B_2),AND(d>V_4 B_1,d<V_4 B_2),AND(d>V_5 B_1,d<V_5 B_2),AND(d>V_6 B_1,d<V_6 B_2)),d,0)","v":42559},{"$f":"IF(OR(AND(d>V_1 C_1,d<V_1 C_2),AND(d>V_2 C_1,d<V_2 C_2),AND(d>V_3 C_1,d<V_3 C_2),AND(d>V_4 C_1,d<V_4 C_2),AND(d>V_5 C_1,d<V_5 C_2),AND(d>V_6 C_1,d<V_6 C_2)),d,0)","v":42559},42559,42559]
[null,null,null,null,null,null,null,null,"2016-07-09",null,{"$f":"IF(OR(AND(d>V_1 A_1,d<V_1 A_2),AND(d>V_2 A_1,d<V_2 A_2),AND(d>V_3 A_1,d<V_3 A_2),AND(d>V_4 A_1,d<V_4 A_2),AND(d>V_5 A_1,d<V_5 A_2),AND(d>V_6 A_1,d<V_6 A_2)),d,0)","v":42560},{"$f":"IF(OR(AND(d>V_1 B_1,d<V_1 B_2),AND(d>V_2 B_1,d<V_2 B_2),AND(d>V_3 B_1,d<V_3 B_2),AND(d>V_4 B_1,d<V_4 B_2),AND(d>V_5 B_1,d<V_5 B_2),AND(d>V_6 B_1,d<V_6 B_2)),d,0)","v":42560},{"$f":"IF(OR(AND(d>V_1 C_1,d<V_1 C_2),AND(d>V_2 C_1,d<V_2 C_2),AND(d>V_3 C_1,d<V_3 C_2),AND(d>V_4 C_1,d<V_4 C_2),AND(d>V_5 C_1,d<V_5 C_2),AND(d>V_6 C_1,d<V_6 C_2)),d,0)","v":42560},42560,42560]
[null,null,null,null,null,null,null,null,"2016-07-10",null,{"$f":"IF(OR(AND(d>V_1 A_1,d<V_1 A_2),AND(d>V_2 A_1,d<V_2 A_2),AND(d>V_3 A_1,d<V_3 A_2),AND(d>V_4 A_1,d<V_4 A_2),AND(d>V_5 A_1,d<V_5 A_2),AND(d>V_6 A_1,d<V_6 A_2)),d,0)","v":42561},{"$f":"IF(OR(AND(d>V_1 B_1,d<V_1 B_2),AND(d>V_2 B_1,d<V_2 B_2),AND(d>V_3 B_1,d<V_3 B_2),AND(d>V_4 B_1,d<V_4 B_2),AND(d>V_5 B_1,d<V_5 B_2),AND(d>V_6 B_1,d<V_6 B_2)),d,0)","v":42561},{"$f":"IF(OR(AND(d>V_1 C_1,d<V_1 C_2),AND(d>V_2 C_1,d<V_2 C_2),AND(d>V_3 C_1,d<V_3 C_2),AND(d>V_4 C_1,d<V_4 C_2),AND(d>V_5 C_1,d<V_5 C_2),AND(d>V_6 C_1,d<V_6 C_2)),d,0)","v":42561},42561,42561]
[null,null,null,null,null,null,null,null,"2016-07-11",null,{"$f":"IF(OR(AND(d>V_1 A_1,d<V_1 A_2),AND(d>V_2 A_1,d<V_2 A_2),AND(d>V_3 A_1,d<V_3 A_2),AND(d>V_4 A_1,d<V_4 A_2),AND(d>V_5 A_1,d<V_5 A_2),AND(d>V_6 A_1,d<V_6 A_2)),d,0)","v":42562},{"$f":"IF(OR(AND(d>V_1 B_1,d<V_1 B_2),AND(d>V_2 B_1,d<V_2 B_2),AND(d>V_3 B_1,d<V_3 B_2),AND(d>V_4 B_1,d<V_4 B_2),AND(d>V_5 B_1,d<V_5 B_2),AND(d>V_6 B_1,d<V_6 B_2)),d,0)","v":42562},{"$f":"IF(OR(AND(d>V_1 C_1,d<V_1 C_2),AND(d>V_2 C_1,d<V_2 C_2),AND(d>V_3 C_1,d<V_3 C_2),AND(d>V_4 C_1,d<V_4 C_2),AND(d>V_5 C_1,d<V_5 C_2),AND(d>V_6 C_1,d<V_6 C_2)),d,0)","v":42562},42562,42562]
[null,null,null,null,null,null,null,null,"2016-07-12",null,{"$f":"IF(OR(AND(d>V_1 A_1,d<V_1 A_2),AND(d>V_2 A_1,d<V_2 A_2),AND(d>V_3 A_1,d<V_3 A_2),AND(d>V_4 A_1,d<V_4 A_2),AND(d>V_5 A_1,d<V_5 A_2),AND(d>V_6 A_1,d<V_6 A_2)),d,0)","v":42563},{"$f":"IF(OR(AND(d>V_1 B_1,d<V_1 B_2),AND(d>V_2 B_1,d<V_2 B_2),AND(d>V_3 B_1,d<V_3 B_2),AND(d>V_4 B_1,d<V_4 B_2),AND(d>V_5 B_1,d<V_5 B_2),AND(d>V_6 B_1,d<V_6 B_2)),d,0)","v":42563},{"$f":"IF(OR(AND(d>V_1 C_1,d<V_1 C_2),AND(d>V_2 C_1,d<V_2 C_2),AND(d>V_3 C_1,d<V_3 C_2),AND(d>V_4 C_1,d<V_4 C_2),AND(d>V_5 C_1,d<V_5 C_2),AND(d>V_6 C_1,d<V_6 C_2)),d,0)","v":42563},42563,42563,"<- à dupliquer ci-dessous"]
[null,null,null,null,null,null,null,null,"2016-07-13",null,{"$f":"IF(OR(AND(d>V_1 A_1,d<V_1 A_2),AND(d>V_2 A_1,d<V_2 A_2),AND(d>V_3 A_1,d<V_3 A_2),AND(d>V_4 A_1,d<V_4 A_2),AND(d>V_5 A_1,d<V_5 A_2),AND(d>V_6 A_1,d<V_6 A_2)),d,0)","v":42564},{"$f":"IF(OR(AND(d>V_1 B_1,d<V_1 B_2),AND(d>V_2 B_1,d<V_2 B_2),AND(d>V_3 B_1,d<V_3 B_2),AND(d>V_4 B_1,d<V_4 B_2),AND(d>V_5 B_1,d<V_5 B_2),AND(d>V_6 B_1,d<V_6 B_2)),d,0)","v":42564},{"$f":"IF(OR(AND(d>V_1 C_1,d<V_1 C_2),AND(d>V_2 C_1,d<V_2 C_2),AND(d>V_3 C_1,d<V_3 C_2),AND(d>V_4 C_1,d<V_4 C_2),AND(d>V_5 C_1,d<V_5 C_2),AND(d>V_6 C_1,d<V_6 C_2)),d,0)","v":42564},{"$f":"MAX(K385:M385)","v":42564},{"$f":"INDEX(J385:N385,choix_zone)","v":42564}]
[null,null,null,null,null,null,null,null,"2016-07-14",null,{"$f":"IF(OR(AND(d>V_1 A_1,d<V_1 A_2),AND(d>V_2 A_1,d<V_2 A_2),AND(d>V_3 A_1,d<V_3 A_2),AND(d>V_4 A_1,d<V_4 A_2),AND(d>V_5 A_1,d<V_5 A_2),AND(d>V_6 A_1,d<V_6 A_2)),d,0)","v":42565},{"$f":"IF(OR(AND(d>V_1 B_1,d<V_1 B_2),AND(d>V_2 B_1,d<V_2 B_2),AND(d>V_3 B_1,d<V_3 B_2),AND(d>V_4 B_1,d<V_4 B_2),AND(d>V_5 B_1,d<V_5 B_2),AND(d>V_6 B_1,d<V_6 B_2)),d,0)","v":42565},{"$f":"IF(OR(AND(d>V_1 C_1,d<V_1 C_2),AND(d>V_2 C_1,d<V_2 C_2),AND(d>V_3 C_1,d<V_3 C_2),AND(d>V_4 C_1,d<V_4 C_2),AND(d>V_5 C_1,d<V_5 C_2),AND(d>V_6 C_1,d<V_6 C_2)),d,0)","v":42565},42565,42565]
[null,null,null,null,null,null,null,null,"2016-07-15",null,{"$f":"IF(OR(AND(d>V_1 A_1,d<V_1 A_2),AND(d>V_2 A_1,d<V_2 A_2),AND(d>V_3 A_1,d<V_3 A_2),AND(d>V_4 A_1,d<V_4 A_2),AND(d>V_5 A_1,d<V_5 A_2),AND(d>V_6 A_1,d<V_6 A_2)),d,0)","v":42566},{"$f":"IF(OR(AND(d>V_1 B_1,d<V_1 B_2),AND(d>V_2 B_1,d<V_2 B_2),AND(d>V_3 B_1,d<V_3 B_2),AND(d>V_4 B_1,d<V_4 B_2),AND(d>V_5 B_1,d<V_5 B_2),AND(d>V_6 B_1,d<V_6 B_2)),d,0)","v":42566},{"$f":"IF(OR(AND(d>V_1 C_1,d<V_1 C_2),AND(d>V_2 C_1,d<V_2 C_2),AND(d>V_3 C_1,d<V_3 C_2),AND(d>V_4 C_1,d<V_4 C_2),AND(d>V_5 C_1,d<V_5 C_2),AND(d>V_6 C_1,d<V_6 C_2)),d,0)","v":42566},42566,42566]
[null,null,null,null,null,null,null,null,"2016-07-16",null,{"$f":"IF(OR(AND(d>V_1 A_1,d<V_1 A_2),AND(d>V_2 A_1,d<V_2 A_2),AND(d>V_3 A_1,d<V_3 A_2),AND(d>V_4 A_1,d<V_4 A_2),AND(d>V_5 A_1,d<V_5 A_2),AND(d>V_6 A_1,d<V_6 A_2)),d,0)","v":42567},{"$f":"IF(OR(AND(d>V_1 B_1,d<V_1 B_2),AND(d>V_2 B_1,d<V_2 B_2),AND(d>V_3 B_1,d<V_3 B_2),AND(d>V_4 B_1,d<V_4 B_2),AND(d>V_5 B_1,d<V_5 B_2),AND(d>V_6 B_1,d<V_6 B_2)),d,0)","v":42567},{"$f":"IF(OR(AND(d>V_1 C_1,d<V_1 C_2),AND(d>V_2 C_1,d<V_2 C_2),AND(d>V_3 C_1,d<V_3 C_2),AND(d>V_4 C_1,d<V_4 C_2),AND(d>V_5 C_1,d<V_5 C_2),AND(d>V_6 C_1,d<V_6 C_2)),d,0)","v":42567},42567,42567]
[null,null,null,null,null,null,null,null,"2016-07-17",null,{"$f":"IF(OR(AND(d>V_1 A_1,d<V_1 A_2),AND(d>V_2 A_1,d<V_2 A_2),AND(d>V_3 A_1,d<V_3 A_2),AND(d>V_4 A_1,d<V_4 A_2),AND(d>V_5 A_1,d<V_5 A_2),AND(d>V_6 A_1,d<V_6 A_2)),d,0)","v":42568},{"$f":"IF(OR(AND(d>V_1 B_1,d<V_1 B_2),AND(d>V_2 B_1,d<V_2 B_2),AND(d>V_3 B_1,d<V_3 B_2),AND(d>V_4 B_1,d<V_4 B_2),AND(d>V_5 B_1,d<V_5 B_2),AND(d>V_6 B_1,d<V_6 B_2)),d,0)","v":42568},{"$f":"IF(OR(AND(d>V_1 C_1,d<V_1 C_2),AND(d>V_2 C_1,d<V_2 C_2),AND(d>V_3 C_1,d<V_3 C_2),AND(d>V_4 C_1,d<V_4 C_2),AND(d>V_5 C_1,d<V_5 C_2),AND(d>V_6 C_1,d<V_6 C_2)),d,0)","v":42568},42568,42568]
[null,null,null,null,null,null,null,null,"2016-07-18",null,{"$f":"IF(OR(AND(d>V_1 A_1,d<V_1 A_2),AND(d>V_2 A_1,d<V_2 A_2),AND(d>V_3 A_1,d<V_3 A_2),AND(d>V_4 A_1,d<V_4 A_2),AND(d>V_5 A_1,d<V_5 A_2),AND(d>V_6 A_1,d<V_6 A_2)),d,0)","v":42569},{"$f":"IF(OR(AND(d>V_1 B_1,d<V_1 B_2),AND(d>V_2 B_1,d<V_2 B_2),AND(d>V_3 B_1,d<V_3 B_2),AND(d>V_4 B_1,d<V_4 B_2),AND(d>V_5 B_1,d<V_5 B_2),AND(d>V_6 B_1,d<V_6 B_2)),d,0)","v":42569},{"$f":"IF(OR(AND(d>V_1 C_1,d<V_1 C_2),AND(d>V_2 C_1,d<V_2 C_2),AND(d>V_3 C_1,d<V_3 C_2),AND(d>V_4 C_1,d<V_4 C_2),AND(d>V_5 C_1,d<V_5 C_2),AND(d>V_6 C_1,d<V_6 C_2)),d,0)","v":42569},42569,42569]
[null,null,null,null,null,null,null,null,"2016-07-19",null,{"$f":"IF(OR(AND(d>V_1 A_1,d<V_1 A_2),AND(d>V_2 A_1,d<V_2 A_2),AND(d>V_3 A_1,d<V_3 A_2),AND(d>V_4 A_1,d<V_4 A_2),AND(d>V_5 A_1,d<V_5 A_2),AND(d>V_6 A_1,d<V_6 A_2)),d,0)","v":42570},{"$f":"IF(OR(AND(d>V_1 B_1,d<V_1 B_2),AND(d>V_2 B_1,d<V_2 B_2),AND(d>V_3 B_1,d<V_3 B_2),AND(d>V_4 B_1,d<V_4 B_2),AND(d>V_5 B_1,d<V_5 B_2),AND(d>V_6 B_1,d<V_6 B_2)),d,0)","v":42570},{"$f":"IF(OR(AND(d>V_1 C_1,d<V_1 C_2),AND(d>V_2 C_1,d<V_2 C_2),AND(d>V_3 C_1,d<V_3 C_2),AND(d>V_4 C_1,d<V_4 C_2),AND(d>V_5 C_1,d<V_5 C_2),AND(d>V_6 C_1,d<V_6 C_2)),d,0)","v":42570},42570,42570]
[null,null,null,null,null,null,null,null,"2016-07-20",null,{"$f":"IF(OR(AND(d>V_1 A_1,d<V_1 A_2),AND(d>V_2 A_1,d<V_2 A_2),AND(d>V_3 A_1,d<V_3 A_2),AND(d>V_4 A_1,d<V_4 A_2),AND(d>V_5 A_1,d<V_5 A_2),AND(d>V_6 A_1,d<V_6 A_2)),d,0)","v":42571},{"$f":"IF(OR(AND(d>V_1 B_1,d<V_1 B_2),AND(d>V_2 B_1,d<V_2 B_2),AND(d>V_3 B_1,d<V_3 B_2),AND(d>V_4 B_1,d<V_4 B_2),AND(d>V_5 B_1,d<V_5 B_2),AND(d>V_6 B_1,d<V_6 B_2)),d,0)","v":42571},{"$f":"IF(OR(AND(d>V_1 C_1,d<V_1 C_2),AND(d>V_2 C_1,d<V_2 C_2),AND(d>V_3 C_1,d<V_3 C_2),AND(d>V_4 C_1,d<V_4 C_2),AND(d>V_5 C_1,d<V_5 C_2),AND(d>V_6 C_1,d<V_6 C_2)),d,0)","v":42571},42571,42571]
[null,null,null,null,null,null,null,null,"2016-07-21",null,{"$f":"IF(OR(AND(d>V_1 A_1,d<V_1 A_2),AND(d>V_2 A_1,d<V_2 A_2),AND(d>V_3 A_1,d<V_3 A_2),AND(d>V_4 A_1,d<V_4 A_2),AND(d>V_5 A_1,d<V_5 A_2),AND(d>V_6 A_1,d<V_6 A_2)),d,0)","v":42572},{"$f":"IF(OR(AND(d>V_1 B_1,d<V_1 B_2),AND(d>V_2 B_1,d<V_2 B_2),AND(d>V_3 B_1,d<V_3 B_2),AND(d>V_4 B_1,d<V_4 B_2),AND(d>V_5 B_1,d<V_5 B_2),AND(d>V_6 B_1,d<V_6 B_2)),d,0)","v":42572},{"$f":"IF(OR(AND(d>V_1 C_1,d<V_1 C_2),AND(d>V_2 C_1,d<V_2 C_2),AND(d>V_3 C_1,d<V_3 C_2),AND(d>V_4 C_1,d<V_4 C_2),AND(d>V_5 C_1,d<V_5 C_2),AND(d>V_6 C_1,d<V_6 C_2)),d,0)","v":42572},42572,42572]
[null,null,null,null,null,null,null,null,"2016-07-22",null,{"$f":"IF(OR(AND(d>V_1 A_1,d<V_1 A_2),AND(d>V_2 A_1,d<V_2 A_2),AND(d>V_3 A_1,d<V_3 A_2),AND(d>V_4 A_1,d<V_4 A_2),AND(d>V_5 A_1,d<V_5 A_2),AND(d>V_6 A_1,d<V_6 A_2)),d,0)","v":42573},{"$f":"IF(OR(AND(d>V_1 B_1,d<V_1 B_2),AND(d>V_2 B_1,d<V_2 B_2),AND(d>V_3 B_1,d<V_3 B_2),AND(d>V_4 B_1,d<V_4 B_2),AND(d>V_5 B_1,d<V_5 B_2),AND(d>V_6 B_1,d<V_6 B_2)),d,0)","v":42573},{"$f":"IF(OR(AND(d>V_1 C_1,d<V_1 C_2),AND(d>V_2 C_1,d<V_2 C_2),AND(d>V_3 C_1,d<V_3 C_2),AND(d>V_4 C_1,d<V_4 C_2),AND(d>V_5 C_1,d<V_5 C_2),AND(d>V_6 C_1,d<V_6 C_2)),d,0)","v":42573},42573,42573]
[null,null,null,null,null,null,null,null,"2016-07-23",null,{"$f":"IF(OR(AND(d>V_1 A_1,d<V_1 A_2),AND(d>V_2 A_1,d<V_2 A_2),AND(d>V_3 A_1,d<V_3 A_2),AND(d>V_4 A_1,d<V_4 A_2),AND(d>V_5 A_1,d<V_5 A_2),AND(d>V_6 A_1,d<V_6 A_2)),d,0)","v":42574},{"$f":"IF(OR(AND(d>V_1 B_1,d<V_1 B_2),AND(d>V_2 B_1,d<V_2 B_2),AND(d>V_3 B_1,d<V_3 B_2),AND(d>V_4 B_1,d<V_4 B_2),AND(d>V_5 B_1,d<V_5 B_2),AND(d>V_6 B_1,d<V_6 B_2)),d,0)","v":42574},{"$f":"IF(OR(AND(d>V_1 C_1,d<V_1 C_2),AND(d>V_2 C_1,d<V_2 C_2),AND(d>V_3 C_1,d<V_3 C_2),AND(d>V_4 C_1,d<V_4 C_2),AND(d>V_5 C_1,d<V_5 C_2),AND(d>V_6 C_1,d<V_6 C_2)),d,0)","v":42574},42574,42574]
[null,null,null,null,null,null,null,null,"2016-07-24",null,{"$f":"IF(OR(AND(d>V_1 A_1,d<V_1 A_2),AND(d>V_2 A_1,d<V_2 A_2),AND(d>V_3 A_1,d<V_3 A_2),AND(d>V_4 A_1,d<V_4 A_2),AND(d>V_5 A_1,d<V_5 A_2),AND(d>V_6 A_1,d<V_6 A_2)),d,0)","v":42575},{"$f":"IF(OR(AND(d>V_1 B_1,d<V_1 B_2),AND(d>V_2 B_1,d<V_2 B_2),AND(d>V_3 B_1,d<V_3 B_2),AND(d>V_4 B_1,d<V_4 B_2),AND(d>V_5 B_1,d<V_5 B_2),AND(d>V_6 B_1,d<V_6 B_2)),d,0)","v":42575},{"$f":"IF(OR(AND(d>V_1 C_1,d<V_1 C_2),AND(d>V_2 C_1,d<V_2 C_2),AND(d>V_3 C_1,d<V_3 C_2),AND(d>V_4 C_1,d<V_4 C_2),AND(d>V_5 C_1,d<V_5 C_2),AND(d>V_6 C_1,d<V_6 C_2)),d,0)","v":42575},42575,42575]
[null,null,null,null,null,null,null,null,"2016-07-25",null,{"$f":"IF(OR(AND(d>V_1 A_1,d<V_1 A_2),AND(d>V_2 A_1,d<V_2 A_2),AND(d>V_3 A_1,d<V_3 A_2),AND(d>V_4 A_1,d<V_4 A_2),AND(d>V_5 A_1,d<V_5 A_2),AND(d>V_6 A_1,d<V_6 A_2)),d,0)","v":42576},{"$f":"IF(OR(AND(d>V_1 B_1,d<V_1 B_2),AND(d>V_2 B_1,d<V_2 B_2),AND(d>V_3 B_1,d<V_3 B_2),AND(d>V_4 B_1,d<V_4 B_2),AND(d>V_5 B_1,d<V_5 B_2),AND(d>V_6 B_1,d<V_6 B_2)),d,0)","v":42576},{"$f":"IF(OR(AND(d>V_1 C_1,d<V_1 C_2),AND(d>V_2 C_1,d<V_2 C_2),AND(d>V_3 C_1,d<V_3 C_2),AND(d>V_4 C_1,d<V_4 C_2),AND(d>V_5 C_1,d<V_5 C_2),AND(d>V_6 C_1,d<V_6 C_2)),d,0)","v":42576},42576,42576]
[null,null,null,null,null,null,null,null,"2016-07-26",null,{"$f":"IF(OR(AND(d>V_1 A_1,d<V_1 A_2),AND(d>V_2 A_1,d<V_2 A_2),AND(d>V_3 A_1,d<V_3 A_2),AND(d>V_4 A_1,d<V_4 A_2),AND(d>V_5 A_1,d<V_5 A_2),AND(d>V_6 A_1,d<V_6 A_2)),d,0)","v":42577},{"$f":"IF(OR(AND(d>V_1 B_1,d<V_1 B_2),AND(d>V_2 B_1,d<V_2 B_2),AND(d>V_3 B_1,d<V_3 B_2),AND(d>V_4 B_1,d<V_4 B_2),AND(d>V_5 B_1,d<V_5 B_2),AND(d>V_6 B_1,d<V_6 B_2)),d,0)","v":42577},{"$f":"IF(OR(AND(d>V_1 C_1,d<V_1 C_2),AND(d>V_2 C_1,d<V_2 C_2),AND(d>V_3 C_1,d<V_3 C_2),AND(d>V_4 C_1,d<V_4 C_2),AND(d>V_5 C_1,d<V_5 C_2),AND(d>V_6 C_1,d<V_6 C_2)),d,0)","v":42577},42577,42577]
[null,null,null,null,null,null,null,null,"2016-07-27",null,{"$f":"IF(OR(AND(d>V_1 A_1,d<V_1 A_2),AND(d>V_2 A_1,d<V_2 A_2),AND(d>V_3 A_1,d<V_3 A_2),AND(d>V_4 A_1,d<V_4 A_2),AND(d>V_5 A_1,d<V_5 A_2),AND(d>V_6 A_1,d<V_6 A_2)),d,0)","v":42578},{"$f":"IF(OR(AND(d>V_1 B_1,d<V_1 B_2),AND(d>V_2 B_1,d<V_2 B_2),AND(d>V_3 B_1,d<V_3 B_2),AND(d>V_4 B_1,d<V_4 B_2),AND(d>V_5 B_1,d<V_5 B_2),AND(d>V_6 B_1,d<V_6 B_2)),d,0)","v":42578},{"$f":"IF(OR(AND(d>V_1 C_1,d<V_1 C_2),AND(d>V_2 C_1,d<V_2 C_2),AND(d>V_3 C_1,d<V_3 C_2),AND(d>V_4 C_1,d<V_4 C_2),AND(d>V_5 C_1,d<V_5 C_2),AND(d>V_6 C_1,d<V_6 C_2)),d,0)","v":42578},42578,42578]
[null,null,null,null,null,null,null,null,"2016-07-28",null,{"$f":"IF(OR(AND(d>V_1 A_1,d<V_1 A_2),AND(d>V_2 A_1,d<V_2 A_2),AND(d>V_3 A_1,d<V_3 A_2),AND(d>V_4 A_1,d<V_4 A_2),AND(d>V_5 A_1,d<V_5 A_2),AND(d>V_6 A_1,d<V_6 A_2)),d,0)","v":42579},{"$f":"IF(OR(AND(d>V_1 B_1,d<V_1 B_2),AND(d>V_2 B_1,d<V_2 B_2),AND(d>V_3 B_1,d<V_3 B_2),AND(d>V_4 B_1,d<V_4 B_2),AND(d>V_5 B_1,d<V_5 B_2),AND(d>V_6 B_1,d<V_6 B_2)),d,0)","v":42579},{"$f":"IF(OR(AND(d>V_1 C_1,d<V_1 C_2),AND(d>V_2 C_1,d<V_2 C_2),AND(d>V_3 C_1,d<V_3 C_2),AND(d>V_4 C_1,d<V_4 C_2),AND(d>V_5 C_1,d<V_5 C_2),AND(d>V_6 C_1,d<V_6 C_2)),d,0)","v":42579},42579,42579]
[null,null,null,null,null,null,null,null,"2016-07-29",null,{"$f":"IF(OR(AND(d>V_1 A_1,d<V_1 A_2),AND(d>V_2 A_1,d<V_2 A_2),AND(d>V_3 A_1,d<V_3 A_2),AND(d>V_4 A_1,d<V_4 A_2),AND(d>V_5 A_1,d<V_5 A_2),AND(d>V_6 A_1,d<V_6 A_2)),d,0)","v":42580},{"$f":"IF(OR(AND(d>V_1 B_1,d<V_1 B_2),AND(d>V_2 B_1,d<V_2 B_2),AND(d>V_3 B_1,d<V_3 B_2),AND(d>V_4 B_1,d<V_4 B_2),AND(d>V_5 B_1,d<V_5 B_2),AND(d>V_6 B_1,d<V_6 B_2)),d,0)","v":42580},{"$f":"IF(OR(AND(d>V_1 C_1,d<V_1 C_2),AND(d>V_2 C_1,d<V_2 C_2),AND(d>V_3 C_1,d<V_3 C_2),AND(d>V_4 C_1,d<V_4 C_2),AND(d>V_5 C_1,d<V_5 C_2),AND(d>V_6 C_1,d<V_6 C_2)),d,0)","v":42580},42580,42580]
[null,null,null,null,null,null,null,null,"2016-07-30",null,{"$f":"IF(OR(AND(d>V_1 A_1,d<V_1 A_2),AND(d>V_2 A_1,d<V_2 A_2),AND(d>V_3 A_1,d<V_3 A_2),AND(d>V_4 A_1,d<V_4 A_2),AND(d>V_5 A_1,d<V_5 A_2),AND(d>V_6 A_1,d<V_6 A_2)),d,0)","v":42581},{"$f":"IF(OR(AND(d>V_1 B_1,d<V_1 B_2),AND(d>V_2 B_1,d<V_2 B_2),AND(d>V_3 B_1,d<V_3 B_2),AND(d>V_4 B_1,d<V_4 B_2),AND(d>V_5 B_1,d<V_5 B_2),AND(d>V_6 B_1,d<V_6 B_2)),d,0)","v":42581},{"$f":"IF(OR(AND(d>V_1 C_1,d<V_1 C_2),AND(d>V_2 C_1,d<V_2 C_2),AND(d>V_3 C_1,d<V_3 C_2),AND(d>V_4 C_1,d<V_4 C_2),AND(d>V_5 C_1,d<V_5 C_2),AND(d>V_6 C_1,d<V_6 C_2)),d,0)","v":42581},42581,42581]
[null,null,null,null,null,null,null,null,"2016-07-31",null,{"$f":"IF(OR(AND(d>V_1 A_1,d<V_1 A_2),AND(d>V_2 A_1,d<V_2 A_2),AND(d>V_3 A_1,d<V_3 A_2),AND(d>V_4 A_1,d<V_4 A_2),AND(d>V_5 A_1,d<V_5 A_2),AND(d>V_6 A_1,d<V_6 A_2)),d,0)","v":42582},{"$f":"IF(OR(AND(d>V_1 B_1,d<V_1 B_2),AND(d>V_2 B_1,d<V_2 B_2),AND(d>V_3 B_1,d<V_3 B_2),AND(d>V_4 B_1,d<V_4 B_2),AND(d>V_5 B_1,d<V_5 B_2),AND(d>V_6 B_1,d<V_6 B_2)),d,0)","v":42582},{"$f":"IF(OR(AND(d>V_1 C_1,d<V_1 C_2),AND(d>V_2 C_1,d<V_2 C_2),AND(d>V_3 C_1,d<V_3 C_2),AND(d>V_4 C_1,d<V_4 C_2),AND(d>V_5 C_1,d<V_5 C_2),AND(d>V_6 C_1,d<V_6 C_2)),d,0)","v":42582},42582,42582]
[null,null,null,null,null,null,null,null,"2016-08-01",null,{"$f":"IF(OR(AND(d>V_1 A_1,d<V_1 A_2),AND(d>V_2 A_1,d<V_2 A_2),AND(d>V_3 A_1,d<V_3 A_2),AND(d>V_4 A_1,d<V_4 A_2),AND(d>V_5 A_1,d<V_5 A_2),AND(d>V_6 A_1,d<V_6 A_2)),d,0)","v":42583},{"$f":"IF(OR(AND(d>V_1 B_1,d<V_1 B_2),AND(d>V_2 B_1,d<V_2 B_2),AND(d>V_3 B_1,d<V_3 B_2),AND(d>V_4 B_1,d<V_4 B_2),AND(d>V_5 B_1,d<V_5 B_2),AND(d>V_6 B_1,d<V_6 B_2)),d,0)","v":42583},{"$f":"IF(OR(AND(d>V_1 C_1,d<V_1 C_2),AND(d>V_2 C_1,d<V_2 C_2),AND(d>V_3 C_1,d<V_3 C_2),AND(d>V_4 C_1,d<V_4 C_2),AND(d>V_5 C_1,d<V_5 C_2),AND(d>V_6 C_1,d<V_6 C_2)),d,0)","v":42583},42583,42583]
[null,null,null,null,null,null,null,null,"2016-08-02",null,{"$f":"IF(OR(AND(d>V_1 A_1,d<V_1 A_2),AND(d>V_2 A_1,d<V_2 A_2),AND(d>V_3 A_1,d<V_3 A_2),AND(d>V_4 A_1,d<V_4 A_2),AND(d>V_5 A_1,d<V_5 A_2),AND(d>V_6 A_1,d<V_6 A_2)),d,0)","v":42584},{"$f":"IF(OR(AND(d>V_1 B_1,d<V_1 B_2),AND(d>V_2 B_1,d<V_2 B_2),AND(d>V_3 B_1,d<V_3 B_2),AND(d>V_4 B_1,d<V_4 B_2),AND(d>V_5 B_1,d<V_5 B_2),AND(d>V_6 B_1,d<V_6 B_2)),d,0)","v":42584},{"$f":"IF(OR(AND(d>V_1 C_1,d<V_1 C_2),AND(d>V_2 C_1,d<V_2 C_2),AND(d>V_3 C_1,d<V_3 C_2),AND(d>V_4 C_1,d<V_4 C_2),AND(d>V_5 C_1,d<V_5 C_2),AND(d>V_6 C_1,d<V_6 C_2)),d,0)","v":42584},42584,42584]
[null,null,null,null,null,null,null,null,"2016-08-03",null,{"$f":"IF(OR(AND(d>V_1 A_1,d<V_1 A_2),AND(d>V_2 A_1,d<V_2 A_2),AND(d>V_3 A_1,d<V_3 A_2),AND(d>V_4 A_1,d<V_4 A_2),AND(d>V_5 A_1,d<V_5 A_2),AND(d>V_6 A_1,d<V_6 A_2)),d,0)","v":42585},{"$f":"IF(OR(AND(d>V_1 B_1,d<V_1 B_2),AND(d>V_2 B_1,d<V_2 B_2),AND(d>V_3 B_1,d<V_3 B_2),AND(d>V_4 B_1,d<V_4 B_2),AND(d>V_5 B_1,d<V_5 B_2),AND(d>V_6 B_1,d<V_6 B_2)),d,0)","v":42585},{"$f":"IF(OR(AND(d>V_1 C_1,d<V_1 C_2),AND(d>V_2 C_1,d<V_2 C_2),AND(d>V_3 C_1,d<V_3 C_2),AND(d>V_4 C_1,d<V_4 C_2),AND(d>V_5 C_1,d<V_5 C_2),AND(d>V_6 C_1,d<V_6 C_2)),d,0)","v":42585},42585,42585]
[null,null,null,null,null,null,null,null,"2016-08-04",null,{"$f":"IF(OR(AND(d>V_1 A_1,d<V_1 A_2),AND(d>V_2 A_1,d<V_2 A_2),AND(d>V_3 A_1,d<V_3 A_2),AND(d>V_4 A_1,d<V_4 A_2),AND(d>V_5 A_1,d<V_5 A_2),AND(d>V_6 A_1,d<V_6 A_2)),d,0)","v":42586},{"$f":"IF(OR(AND(d>V_1 B_1,d<V_1 B_2),AND(d>V_2 B_1,d<V_2 B_2),AND(d>V_3 B_1,d<V_3 B_2),AND(d>V_4 B_1,d<V_4 B_2),AND(d>V_5 B_1,d<V_5 B_2),AND(d>V_6 B_1,d<V_6 B_2)),d,0)","v":42586},{"$f":"IF(OR(AND(d>V_1 C_1,d<V_1 C_2),AND(d>V_2 C_1,d<V_2 C_2),AND(d>V_3 C_1,d<V_3 C_2),AND(d>V_4 C_1,d<V_4 C_2),AND(d>V_5 C_1,d<V_5 C_2),AND(d>V_6 C_1,d<V_6 C_2)),d,0)","v":42586},42586,42586]
[null,null,null,null,null,null,null,null,"2016-08-05",null,{"$f":"IF(OR(AND(d>V_1 A_1,d<V_1 A_2),AND(d>V_2 A_1,d<V_2 A_2),AND(d>V_3 A_1,d<V_3 A_2),AND(d>V_4 A_1,d<V_4 A_2),AND(d>V_5 A_1,d<V_5 A_2),AND(d>V_6 A_1,d<V_6 A_2)),d,0)","v":42587},{"$f":"IF(OR(AND(d>V_1 B_1,d<V_1 B_2),AND(d>V_2 B_1,d<V_2 B_2),AND(d>V_3 B_1,d<V_3 B_2),AND(d>V_4 B_1,d<V_4 B_2),AND(d>V_5 B_1,d<V_5 B_2),AND(d>V_6 B_1,d<V_6 B_2)),d,0)","v":42587},{"$f":"IF(OR(AND(d>V_1 C_1,d<V_1 C_2),AND(d>V_2 C_1,d<V_2 C_2),AND(d>V_3 C_1,d<V_3 C_2),AND(d>V_4 C_1,d<V_4 C_2),AND(d>V_5 C_1,d<V_5 C_2),AND(d>V_6 C_1,d<V_6 C_2)),d,0)","v":42587},42587,42587]
[null,null,null,null,null,null,null,null,"2016-08-06",null,{"$f":"IF(OR(AND(d>V_1 A_1,d<V_1 A_2),AND(d>V_2 A_1,d<V_2 A_2),AND(d>V_3 A_1,d<V_3 A_2),AND(d>V_4 A_1,d<V_4 A_2),AND(d>V_5 A_1,d<V_5 A_2),AND(d>V_6 A_1,d<V_6 A_2)),d,0)","v":42588},{"$f":"IF(OR(AND(d>V_1 B_1,d<V_1 B_2),AND(d>V_2 B_1,d<V_2 B_2),AND(d>V_3 B_1,d<V_3 B_2),AND(d>V_4 B_1,d<V_4 B_2),AND(d>V_5 B_1,d<V_5 B_2),AND(d>V_6 B_1,d<V_6 B_2)),d,0)","v":42588},{"$f":"IF(OR(AND(d>V_1 C_1,d<V_1 C_2),AND(d>V_2 C_1,d<V_2 C_2),AND(d>V_3 C_1,d<V_3 C_2),AND(d>V_4 C_1,d<V_4 C_2),AND(d>V_5 C_1,d<V_5 C_2),AND(d>V_6 C_1,d<V_6 C_2)),d,0)","v":42588},42588,42588]
[null,null,null,null,null,null,null,null,"2016-08-07",null,{"$f":"IF(OR(AND(d>V_1 A_1,d<V_1 A_2),AND(d>V_2 A_1,d<V_2 A_2),AND(d>V_3 A_1,d<V_3 A_2),AND(d>V_4 A_1,d<V_4 A_2),AND(d>V_5 A_1,d<V_5 A_2),AND(d>V_6 A_1,d<V_6 A_2)),d,0)","v":42589},{"$f":"IF(OR(AND(d>V_1 B_1,d<V_1 B_2),AND(d>V_2 B_1,d<V_2 B_2),AND(d>V_3 B_1,d<V_3 B_2),AND(d>V_4 B_1,d<V_4 B_2),AND(d>V_5 B_1,d<V_5 B_2),AND(d>V_6 B_1,d<V_6 B_2)),d,0)","v":42589},{"$f":"IF(OR(AND(d>V_1 C_1,d<V_1 C_2),AND(d>V_2 C_1,d<V_2 C_2),AND(d>V_3 C_1,d<V_3 C_2),AND(d>V_4 C_1,d<V_4 C_2),AND(d>V_5 C_1,d<V_5 C_2),AND(d>V_6 C_1,d<V_6 C_2)),d,0)","v":42589},42589,42589]
[null,null,null,null,null,null,null,null,"2016-08-08",null,{"$f":"IF(OR(AND(d>V_1 A_1,d<V_1 A_2),AND(d>V_2 A_1,d<V_2 A_2),AND(d>V_3 A_1,d<V_3 A_2),AND(d>V_4 A_1,d<V_4 A_2),AND(d>V_5 A_1,d<V_5 A_2),AND(d>V_6 A_1,d<V_6 A_2)),d,0)","v":42590},{"$f":"IF(OR(AND(d>V_1 B_1,d<V_1 B_2),AND(d>V_2 B_1,d<V_2 B_2),AND(d>V_3 B_1,d<V_3 B_2),AND(d>V_4 B_1,d<V_4 B_2),AND(d>V_5 B_1,d<V_5 B_2),AND(d>V_6 B_1,d<V_6 B_2)),d,0)","v":42590},{"$f":"IF(OR(AND(d>V_1 C_1,d<V_1 C_2),AND(d>V_2 C_1,d<V_2 C_2),AND(d>V_3 C_1,d<V_3 C_2),AND(d>V_4 C_1,d<V_4 C_2),AND(d>V_5 C_1,d<V_5 C_2),AND(d>V_6 C_1,d<V_6 C_2)),d,0)","v":42590},42590,42590]
[null,null,null,null,null,null,null,null,"2016-08-09",null,{"$f":"IF(OR(AND(d>V_1 A_1,d<V_1 A_2),AND(d>V_2 A_1,d<V_2 A_2),AND(d>V_3 A_1,d<V_3 A_2),AND(d>V_4 A_1,d<V_4 A_2),AND(d>V_5 A_1,d<V_5 A_2),AND(d>V_6 A_1,d<V_6 A_2)),d,0)","v":42591},{"$f":"IF(OR(AND(d>V_1 B_1,d<V_1 B_2),AND(d>V_2 B_1,d<V_2 B_2),AND(d>V_3 B_1,d<V_3 B_2),AND(d>V_4 B_1,d<V_4 B_2),AND(d>V_5 B_1,d<V_5 B_2),AND(d>V_6 B_1,d<V_6 B_2)),d,0)","v":42591},{"$f":"IF(OR(AND(d>V_1 C_1,d<V_1 C_2),AND(d>V_2 C_1,d<V_2 C_2),AND(d>V_3 C_1,d<V_3 C_2),AND(d>V_4 C_1,d<V_4 C_2),AND(d>V_5 C_1,d<V_5 C_2),AND(d>V_6 C_1,d<V_6 C_2)),d,0)","v":42591},42591,42591]
[null,null,null,null,null,null,null,null,"2016-08-10",null,{"$f":"IF(OR(AND(d>V_1 A_1,d<V_1 A_2),AND(d>V_2 A_1,d<V_2 A_2),AND(d>V_3 A_1,d<V_3 A_2),AND(d>V_4 A_1,d<V_4 A_2),AND(d>V_5 A_1,d<V_5 A_2),AND(d>V_6 A_1,d<V_6 A_2)),d,0)","v":42592},{"$f":"IF(OR(AND(d>V_1 B_1,d<V_1 B_2),AND(d>V_2 B_1,d<V_2 B_2),AND(d>V_3 B_1,d<V_3 B_2),AND(d>V_4 B_1,d<V_4 B_2),AND(d>V_5 B_1,d<V_5 B_2),AND(d>V_6 B_1,d<V_6 B_2)),d,0)","v":42592},{"$f":"IF(OR(AND(d>V_1 C_1,d<V_1 C_2),AND(d>V_2 C_1,d<V_2 C_2),AND(d>V_3 C_1,d<V_3 C_2),AND(d>V_4 C_1,d<V_4 C_2),AND(d>V_5 C_1,d<V_5 C_2),AND(d>V_6 C_1,d<V_6 C_2)),d,0)","v":42592},42592,42592]
[null,null,null,null,null,null,null,null,"2016-08-11",null,{"$f":"IF(OR(AND(d>V_1 A_1,d<V_1 A_2),AND(d>V_2 A_1,d<V_2 A_2),AND(d>V_3 A_1,d<V_3 A_2),AND(d>V_4 A_1,d<V_4 A_2),AND(d>V_5 A_1,d<V_5 A_2),AND(d>V_6 A_1,d<V_6 A_2)),d,0)","v":42593},{"$f":"IF(OR(AND(d>V_1 B_1,d<V_1 B_2),AND(d>V_2 B_1,d<V_2 B_2),AND(d>V_3 B_1,d<V_3 B_2),AND(d>V_4 B_1,d<V_4 B_2),AND(d>V_5 B_1,d<V_5 B_2),AND(d>V_6 B_1,d<V_6 B_2)),d,0)","v":42593},{"$f":"IF(OR(AND(d>V_1 C_1,d<V_1 C_2),AND(d>V_2 C_1,d<V_2 C_2),AND(d>V_3 C_1,d<V_3 C_2),AND(d>V_4 C_1,d<V_4 C_2),AND(d>V_5 C_1,d<V_5 C_2),AND(d>V_6 C_1,d<V_6 C_2)),d,0)","v":42593},42593,42593]
[null,null,null,null,null,null,null,null,"2016-08-12",null,{"$f":"IF(OR(AND(d>V_1 A_1,d<V_1 A_2),AND(d>V_2 A_1,d<V_2 A_2),AND(d>V_3 A_1,d<V_3 A_2),AND(d>V_4 A_1,d<V_4 A_2),AND(d>V_5 A_1,d<V_5 A_2),AND(d>V_6 A_1,d<V_6 A_2)),d,0)","v":42594},{"$f":"IF(OR(AND(d>V_1 B_1,d<V_1 B_2),AND(d>V_2 B_1,d<V_2 B_2),AND(d>V_3 B_1,d<V_3 B_2),AND(d>V_4 B_1,d<V_4 B_2),AND(d>V_5 B_1,d<V_5 B_2),AND(d>V_6 B_1,d<V_6 B_2)),d,0)","v":42594},{"$f":"IF(OR(AND(d>V_1 C_1,d<V_1 C_2),AND(d>V_2 C_1,d<V_2 C_2),AND(d>V_3 C_1,d<V_3 C_2),AND(d>V_4 C_1,d<V_4 C_2),AND(d>V_5 C_1,d<V_5 C_2),AND(d>V_6 C_1,d<V_6 C_2)),d,0)","v":42594},42594,42594]
[null,null,null,null,null,null,null,null,"2016-08-13",null,{"$f":"IF(OR(AND(d>V_1 A_1,d<V_1 A_2),AND(d>V_2 A_1,d<V_2 A_2),AND(d>V_3 A_1,d<V_3 A_2),AND(d>V_4 A_1,d<V_4 A_2),AND(d>V_5 A_1,d<V_5 A_2),AND(d>V_6 A_1,d<V_6 A_2)),d,0)","v":42595},{"$f":"IF(OR(AND(d>V_1 B_1,d<V_1 B_2),AND(d>V_2 B_1,d<V_2 B_2),AND(d>V_3 B_1,d<V_3 B_2),AND(d>V_4 B_1,d<V_4 B_2),AND(d>V_5 B_1,d<V_5 B_2),AND(d>V_6 B_1,d<V_6 B_2)),d,0)","v":42595},{"$f":"IF(OR(AND(d>V_1 C_1,d<V_1 C_2),AND(d>V_2 C_1,d<V_2 C_2),AND(d>V_3 C_1,d<V_3 C_2),AND(d>V_4 C_1,d<V_4 C_2),AND(d>V_5 C_1,d<V_5 C_2),AND(d>V_6 C_1,d<V_6 C_2)),d,0)","v":42595},42595,42595]
[null,null,null,null,null,null,null,null,"2016-08-14",null,{"$f":"IF(OR(AND(d>V_1 A_1,d<V_1 A_2),AND(d>V_2 A_1,d<V_2 A_2),AND(d>V_3 A_1,d<V_3 A_2),AND(d>V_4 A_1,d<V_4 A_2),AND(d>V_5 A_1,d<V_5 A_2),AND(d>V_6 A_1,d<V_6 A_2)),d,0)","v":42596},{"$f":"IF(OR(AND(d>V_1 B_1,d<V_1 B_2),AND(d>V_2 B_1,d<V_2 B_2),AND(d>V_3 B_1,d<V_3 B_2),AND(d>V_4 B_1,d<V_4 B_2),AND(d>V_5 B_1,d<V_5 B_2),AND(d>V_6 B_1,d<V_6 B_2)),d,0)","v":42596},{"$f":"IF(OR(AND(d>V_1 C_1,d<V_1 C_2),AND(d>V_2 C_1,d<V_2 C_2),AND(d>V_3 C_1,d<V_3 C_2),AND(d>V_4 C_1,d<V_4 C_2),AND(d>V_5 C_1,d<V_5 C_2),AND(d>V_6 C_1,d<V_6 C_2)),d,0)","v":42596},42596,42596]
[null,null,null,null,null,null,null,null,"2016-08-15",null,{"$f":"IF(OR(AND(d>V_1 A_1,d<V_1 A_2),AND(d>V_2 A_1,d<V_2 A_2),AND(d>V_3 A_1,d<V_3 A_2),AND(d>V_4 A_1,d<V_4 A_2),AND(d>V_5 A_1,d<V_5 A_2),AND(d>V_6 A_1,d<V_6 A_2)),d,0)","v":42597},{"$f":"IF(OR(AND(d>V_1 B_1,d<V_1 B_2),AND(d>V_2 B_1,d<V_2 B_2),AND(d>V_3 B_1,d<V_3 B_2),AND(d>V_4 B_1,d<V_4 B_2),AND(d>V_5 B_1,d<V_5 B_2),AND(d>V_6 B_1,d<V_6 B_2)),d,0)","v":42597},{"$f":"IF(OR(AND(d>V_1 C_1,d<V_1 C_2),AND(d>V_2 C_1,d<V_2 C_2),AND(d>V_3 C_1,d<V_3 C_2),AND(d>V_4 C_1,d<V_4 C_2),AND(d>V_5 C_1,d<V_5 C_2),AND(d>V_6 C_1,d<V_6 C_2)),d,0)","v":42597},42597,42597]
[null,null,null,null,null,null,null,null,"2016-08-16",null,{"$f":"IF(OR(AND(d>V_1 A_1,d<V_1 A_2),AND(d>V_2 A_1,d<V_2 A_2),AND(d>V_3 A_1,d<V_3 A_2),AND(d>V_4 A_1,d<V_4 A_2),AND(d>V_5 A_1,d<V_5 A_2),AND(d>V_6 A_1,d<V_6 A_2)),d,0)","v":42598},{"$f":"IF(OR(AND(d>V_1 B_1,d<V_1 B_2),AND(d>V_2 B_1,d<V_2 B_2),AND(d>V_3 B_1,d<V_3 B_2),AND(d>V_4 B_1,d<V_4 B_2),AND(d>V_5 B_1,d<V_5 B_2),AND(d>V_6 B_1,d<V_6 B_2)),d,0)","v":42598},{"$f":"IF(OR(AND(d>V_1 C_1,d<V_1 C_2),AND(d>V_2 C_1,d<V_2 C_2),AND(d>V_3 C_1,d<V_3 C_2),AND(d>V_4 C_1,d<V_4 C_2),AND(d>V_5 C_1,d<V_5 C_2),AND(d>V_6 C_1,d<V_6 C_2)),d,0)","v":42598},42598,42598]
[null,null,null,null,null,null,null,null,"2016-08-17",null,{"$f":"IF(OR(AND(d>V_1 A_1,d<V_1 A_2),AND(d>V_2 A_1,d<V_2 A_2),AND(d>V_3 A_1,d<V_3 A_2),AND(d>V_4 A_1,d<V_4 A_2),AND(d>V_5 A_1,d<V_5 A_2),AND(d>V_6 A_1,d<V_6 A_2)),d,0)","v":42599},{"$f":"IF(OR(AND(d>V_1 B_1,d<V_1 B_2),AND(d>V_2 B_1,d<V_2 B_2),AND(d>V_3 B_1,d<V_3 B_2),AND(d>V_4 B_1,d<V_4 B_2),AND(d>V_5 B_1,d<V_5 B_2),AND(d>V_6 B_1,d<V_6 B_2)),d,0)","v":42599},{"$f":"IF(OR(AND(d>V_1 C_1,d<V_1 C_2),AND(d>V_2 C_1,d<V_2 C_2),AND(d>V_3 C_1,d<V_3 C_2),AND(d>V_4 C_1,d<V_4 C_2),AND(d>V_5 C_1,d<V_5 C_2),AND(d>V_6 C_1,d<V_6 C_2)),d,0)","v":42599},42599,42599]
[null,null,null,null,null,null,null,null,"2016-08-18",null,{"$f":"IF(OR(AND(d>V_1 A_1,d<V_1 A_2),AND(d>V_2 A_1,d<V_2 A_2),AND(d>V_3 A_1,d<V_3 A_2),AND(d>V_4 A_1,d<V_4 A_2),AND(d>V_5 A_1,d<V_5 A_2),AND(d>V_6 A_1,d<V_6 A_2)),d,0)","v":42600},{"$f":"IF(OR(AND(d>V_1 B_1,d<V_1 B_2),AND(d>V_2 B_1,d<V_2 B_2),AND(d>V_3 B_1,d<V_3 B_2),AND(d>V_4 B_1,d<V_4 B_2),AND(d>V_5 B_1,d<V_5 B_2),AND(d>V_6 B_1,d<V_6 B_2)),d,0)","v":42600},{"$f":"IF(OR(AND(d>V_1 C_1,d<V_1 C_2),AND(d>V_2 C_1,d<V_2 C_2),AND(d>V_3 C_1,d<V_3 C_2),AND(d>V_4 C_1,d<V_4 C_2),AND(d>V_5 C_1,d<V_5 C_2),AND(d>V_6 C_1,d<V_6 C_2)),d,0)","v":42600},42600,42600]
[null,null,null,null,null,null,null,null,"2016-08-19",null,{"$f":"IF(OR(AND(d>V_1 A_1,d<V_1 A_2),AND(d>V_2 A_1,d<V_2 A_2),AND(d>V_3 A_1,d<V_3 A_2),AND(d>V_4 A_1,d<V_4 A_2),AND(d>V_5 A_1,d<V_5 A_2),AND(d>V_6 A_1,d<V_6 A_2)),d,0)","v":42601},{"$f":"IF(OR(AND(d>V_1 B_1,d<V_1 B_2),AND(d>V_2 B_1,d<V_2 B_2),AND(d>V_3 B_1,d<V_3 B_2),AND(d>V_4 B_1,d<V_4 B_2),AND(d>V_5 B_1,d<V_5 B_2),AND(d>V_6 B_1,d<V_6 B_2)),d,0)","v":42601},{"$f":"IF(OR(AND(d>V_1 C_1,d<V_1 C_2),AND(d>V_2 C_1,d<V_2 C_2),AND(d>V_3 C_1,d<V_3 C_2),AND(d>V_4 C_1,d<V_4 C_2),AND(d>V_5 C_1,d<V_5 C_2),AND(d>V_6 C_1,d<V_6 C_2)),d,0)","v":42601},42601,42601]
[null,null,null,null,null,null,null,null,"2016-08-20",null,{"$f":"IF(OR(AND(d>V_1 A_1,d<V_1 A_2),AND(d>V_2 A_1,d<V_2 A_2),AND(d>V_3 A_1,d<V_3 A_2),AND(d>V_4 A_1,d<V_4 A_2),AND(d>V_5 A_1,d<V_5 A_2),AND(d>V_6 A_1,d<V_6 A_2)),d,0)","v":42602},{"$f":"IF(OR(AND(d>V_1 B_1,d<V_1 B_2),AND(d>V_2 B_1,d<V_2 B_2),AND(d>V_3 B_1,d<V_3 B_2),AND(d>V_4 B_1,d<V_4 B_2),AND(d>V_5 B_1,d<V_5 B_2),AND(d>V_6 B_1,d<V_6 B_2)),d,0)","v":42602},{"$f":"IF(OR(AND(d>V_1 C_1,d<V_1 C_2),AND(d>V_2 C_1,d<V_2 C_2),AND(d>V_3 C_1,d<V_3 C_2),AND(d>V_4 C_1,d<V_4 C_2),AND(d>V_5 C_1,d<V_5 C_2),AND(d>V_6 C_1,d<V_6 C_2)),d,0)","v":42602},42602,42602]
[null,null,null,null,null,null,null,null,"2016-08-21",null,{"$f":"IF(OR(AND(d>V_1 A_1,d<V_1 A_2),AND(d>V_2 A_1,d<V_2 A_2),AND(d>V_3 A_1,d<V_3 A_2),AND(d>V_4 A_1,d<V_4 A_2),AND(d>V_5 A_1,d<V_5 A_2),AND(d>V_6 A_1,d<V_6 A_2)),d,0)","v":42603},{"$f":"IF(OR(AND(d>V_1 B_1,d<V_1 B_2),AND(d>V_2 B_1,d<V_2 B_2),AND(d>V_3 B_1,d<V_3 B_2),AND(d>V_4 B_1,d<V_4 B_2),AND(d>V_5 B_1,d<V_5 B_2),AND(d>V_6 B_1,d<V_6 B_2)),d,0)","v":42603},{"$f":"IF(OR(AND(d>V_1 C_1,d<V_1 C_2),AND(d>V_2 C_1,d<V_2 C_2),AND(d>V_3 C_1,d<V_3 C_2),AND(d>V_4 C_1,d<V_4 C_2),AND(d>V_5 C_1,d<V_5 C_2),AND(d>V_6 C_1,d<V_6 C_2)),d,0)","v":42603},42603,42603]
[null,null,null,null,null,null,null,null,"2016-08-22",null,{"$f":"IF(OR(AND(d>V_1 A_1,d<V_1 A_2),AND(d>V_2 A_1,d<V_2 A_2),AND(d>V_3 A_1,d<V_3 A_2),AND(d>V_4 A_1,d<V_4 A_2),AND(d>V_5 A_1,d<V_5 A_2),AND(d>V_6 A_1,d<V_6 A_2)),d,0)","v":42604},{"$f":"IF(OR(AND(d>V_1 B_1,d<V_1 B_2),AND(d>V_2 B_1,d<V_2 B_2),AND(d>V_3 B_1,d<V_3 B_2),AND(d>V_4 B_1,d<V_4 B_2),AND(d>V_5 B_1,d<V_5 B_2),AND(d>V_6 B_1,d<V_6 B_2)),d,0)","v":42604},{"$f":"IF(OR(AND(d>V_1 C_1,d<V_1 C_2),AND(d>V_2 C_1,d<V_2 C_2),AND(d>V_3 C_1,d<V_3 C_2),AND(d>V_4 C_1,d<V_4 C_2),AND(d>V_5 C_1,d<V_5 C_2),AND(d>V_6 C_1,d<V_6 C_2)),d,0)","v":42604},42604,42604]
[null,null,null,null,null,null,null,null,"2016-08-23",null,{"$f":"IF(OR(AND(d>V_1 A_1,d<V_1 A_2),AND(d>V_2 A_1,d<V_2 A_2),AND(d>V_3 A_1,d<V_3 A_2),AND(d>V_4 A_1,d<V_4 A_2),AND(d>V_5 A_1,d<V_5 A_2),AND(d>V_6 A_1,d<V_6 A_2)),d,0)","v":42605},{"$f":"IF(OR(AND(d>V_1 B_1,d<V_1 B_2),AND(d>V_2 B_1,d<V_2 B_2),AND(d>V_3 B_1,d<V_3 B_2),AND(d>V_4 B_1,d<V_4 B_2),AND(d>V_5 B_1,d<V_5 B_2),AND(d>V_6 B_1,d<V_6 B_2)),d,0)","v":42605},{"$f":"IF(OR(AND(d>V_1 C_1,d<V_1 C_2),AND(d>V_2 C_1,d<V_2 C_2),AND(d>V_3 C_1,d<V_3 C_2),AND(d>V_4 C_1,d<V_4 C_2),AND(d>V_5 C_1,d<V_5 C_2),AND(d>V_6 C_1,d<V_6 C_2)),d,0)","v":42605},42605,42605]
[null,null,null,null,null,null,null,null,"2016-08-24",null,{"$f":"IF(OR(AND(d>V_1 A_1,d<V_1 A_2),AND(d>V_2 A_1,d<V_2 A_2),AND(d>V_3 A_1,d<V_3 A_2),AND(d>V_4 A_1,d<V_4 A_2),AND(d>V_5 A_1,d<V_5 A_2),AND(d>V_6 A_1,d<V_6 A_2)),d,0)","v":42606},{"$f":"IF(OR(AND(d>V_1 B_1,d<V_1 B_2),AND(d>V_2 B_1,d<V_2 B_2),AND(d>V_3 B_1,d<V_3 B_2),AND(d>V_4 B_1,d<V_4 B_2),AND(d>V_5 B_1,d<V_5 B_2),AND(d>V_6 B_1,d<V_6 B_2)),d,0)","v":42606},{"$f":"IF(OR(AND(d>V_1 C_1,d<V_1 C_2),AND(d>V_2 C_1,d<V_2 C_2),AND(d>V_3 C_1,d<V_3 C_2),AND(d>V_4 C_1,d<V_4 C_2),AND(d>V_5 C_1,d<V_5 C_2),AND(d>V_6 C_1,d<V_6 C_2)),d,0)","v":42606},42606,42606]
[null,null,null,null,null,null,null,null,"2016-08-25",null,{"$f":"IF(OR(AND(d>V_1 A_1,d<V_1 A_2),AND(d>V_2 A_1,d<V_2 A_2),AND(d>V_3 A_1,d<V_3 A_2),AND(d>V_4 A_1,d<V_4 A_2),AND(d>V_5 A_1,d<V_5 A_2),AND(d>V_6 A_1,d<V_6 A_2)),d,0)","v":42607},{"$f":"IF(OR(AND(d>V_1 B_1,d<V_1 B_2),AND(d>V_2 B_1,d<V_2 B_2),AND(d>V_3 B_1,d<V_3 B_2),AND(d>V_4 B_1,d<V_4 B_2),AND(d>V_5 B_1,d<V_5 B_2),AND(d>V_6 B_1,d<V_6 B_2)),d,0)","v":42607},{"$f":"IF(OR(AND(d>V_1 C_1,d<V_1 C_2),AND(d>V_2 C_1,d<V_2 C_2),AND(d>V_3 C_1,d<V_3 C_2),AND(d>V_4 C_1,d<V_4 C_2),AND(d>V_5 C_1,d<V_5 C_2),AND(d>V_6 C_1,d<V_6 C_2)),d,0)","v":42607},42607,42607]
[null,null,null,null,null,null,null,null,"2016-08-26",null,{"$f":"IF(OR(AND(d>V_1 A_1,d<V_1 A_2),AND(d>V_2 A_1,d<V_2 A_2),AND(d>V_3 A_1,d<V_3 A_2),AND(d>V_4 A_1,d<V_4 A_2),AND(d>V_5 A_1,d<V_5 A_2),AND(d>V_6 A_1,d<V_6 A_2)),d,0)","v":42608},{"$f":"IF(OR(AND(d>V_1 B_1,d<V_1 B_2),AND(d>V_2 B_1,d<V_2 B_2),AND(d>V_3 B_1,d<V_3 B_2),AND(d>V_4 B_1,d<V_4 B_2),AND(d>V_5 B_1,d<V_5 B_2),AND(d>V_6 B_1,d<V_6 B_2)),d,0)","v":42608},{"$f":"IF(OR(AND(d>V_1 C_1,d<V_1 C_2),AND(d>V_2 C_1,d<V_2 C_2),AND(d>V_3 C_1,d<V_3 C_2),AND(d>V_4 C_1,d<V_4 C_2),AND(d>V_5 C_1,d<V_5 C_2),AND(d>V_6 C_1,d<V_6 C_2)),d,0)","v":42608},42608,42608]
[null,null,null,null,null,null,null,null,"2016-08-27",null,{"$f":"IF(OR(AND(d>V_1 A_1,d<V_1 A_2),AND(d>V_2 A_1,d<V_2 A_2),AND(d>V_3 A_1,d<V_3 A_2),AND(d>V_4 A_1,d<V_4 A_2),AND(d>V_5 A_1,d<V_5 A_2),AND(d>V_6 A_1,d<V_6 A_2)),d,0)","v":42609},{"$f":"IF(OR(AND(d>V_1 B_1,d<V_1 B_2),AND(d>V_2 B_1,d<V_2 B_2),AND(d>V_3 B_1,d<V_3 B_2),AND(d>V_4 B_1,d<V_4 B_2),AND(d>V_5 B_1,d<V_5 B_2),AND(d>V_6 B_1,d<V_6 B_2)),d,0)","v":42609},{"$f":"IF(OR(AND(d>V_1 C_1,d<V_1 C_2),AND(d>V_2 C_1,d<V_2 C_2),AND(d>V_3 C_1,d<V_3 C_2),AND(d>V_4 C_1,d<V_4 C_2),AND(d>V_5 C_1,d<V_5 C_2),AND(d>V_6 C_1,d<V_6 C_2)),d,0)","v":42609},42609,42609]
[null,null,null,null,null,null,null,null,"2016-08-28",null,{"$f":"IF(OR(AND(d>V_1 A_1,d<V_1 A_2),AND(d>V_2 A_1,d<V_2 A_2),AND(d>V_3 A_1,d<V_3 A_2),AND(d>V_4 A_1,d<V_4 A_2),AND(d>V_5 A_1,d<V_5 A_2),AND(d>V_6 A_1,d<V_6 A_2)),d,0)","v":42610},{"$f":"IF(OR(AND(d>V_1 B_1,d<V_1 B_2),AND(d>V_2 B_1,d<V_2 B_2),AND(d>V_3 B_1,d<V_3 B_2),AND(d>V_4 B_1,d<V_4 B_2),AND(d>V_5 B_1,d<V_5 B_2),AND(d>V_6 B_1,d<V_6 B_2)),d,0)","v":42610},{"$f":"IF(OR(AND(d>V_1 C_1,d<V_1 C_2),AND(d>V_2 C_1,d<V_2 C_2),AND(d>V_3 C_1,d<V_3 C_2),AND(d>V_4 C_1,d<V_4 C_2),AND(d>V_5 C_1,d<V_5 C_2),AND(d>V_6 C_1,d<V_6 C_2)),d,0)","v":42610},42610,42610]
[null,null,null,null,null,null,null,null,"2016-08-29",null,{"$f":"IF(OR(AND(d>V_1 A_1,d<V_1 A_2),AND(d>V_2 A_1,d<V_2 A_2),AND(d>V_3 A_1,d<V_3 A_2),AND(d>V_4 A_1,d<V_4 A_2),AND(d>V_5 A_1,d<V_5 A_2),AND(d>V_6 A_1,d<V_6 A_2)),d,0)","v":42611},{"$f":"IF(OR(AND(d>V_1 B_1,d<V_1 B_2),AND(d>V_2 B_1,d<V_2 B_2),AND(d>V_3 B_1,d<V_3 B_2),AND(d>V_4 B_1,d<V_4 B_2),AND(d>V_5 B_1,d<V_5 B_2),AND(d>V_6 B_1,d<V_6 B_2)),d,0)","v":42611},{"$f":"IF(OR(AND(d>V_1 C_1,d<V_1 C_2),AND(d>V_2 C_1,d<V_2 C_2),AND(d>V_3 C_1,d<V_3 C_2),AND(d>V_4 C_1,d<V_4 C_2),AND(d>V_5 C_1,d<V_5 C_2),AND(d>V_6 C_1,d<V_6 C_2)),d,0)","v":42611},42611,42611]
[null,null,null,null,null,null,null,null,"2016-08-30",null,{"$f":"IF(OR(AND(d>V_1 A_1,d<V_1 A_2),AND(d>V_2 A_1,d<V_2 A_2),AND(d>V_3 A_1,d<V_3 A_2),AND(d>V_4 A_1,d<V_4 A_2),AND(d>V_5 A_1,d<V_5 A_2),AND(d>V_6 A_1,d<V_6 A_2)),d,0)","v":42612},{"$f":"IF(OR(AND(d>V_1 B_1,d<V_1 B_2),AND(d>V_2 B_1,d<V_2 B_2),AND(d>V_3 B_1,d<V_3 B_2),AND(d>V_4 B_1,d<V_4 B_2),AND(d>V_5 B_1,d<V_5 B_2),AND(d>V_6 B_1,d<V_6 B_2)),d,0)","v":42612},{"$f":"IF(OR(AND(d>V_1 C_1,d<V_1 C_2),AND(d>V_2 C_1,d<V_2 C_2),AND(d>V_3 C_1,d<V_3 C_2),AND(d>V_4 C_1,d<V_4 C_2),AND(d>V_5 C_1,d<V_5 C_2),AND(d>V_6 C_1,d<V_6 C_2)),d,0)","v":42612},42612,42612]
[null,null,null,null,null,null,null,null,"2016-08-31",null,{"$f":"IF(OR(AND(d>V_1 A_1,d<V_1 A_2),AND(d>V_2 A_1,d<V_2 A_2),AND(d>V_3 A_1,d<V_3 A_2),AND(d>V_4 A_1,d<V_4 A_2),AND(d>V_5 A_1,d<V_5 A_2),AND(d>V_6 A_1,d<V_6 A_2)),d,0)","v":42613},{"$f":"IF(OR(AND(d>V_1 B_1,d<V_1 B_2),AND(d>V_2 B_1,d<V_2 B_2),AND(d>V_3 B_1,d<V_3 B_2),AND(d>V_4 B_1,d<V_4 B_2),AND(d>V_5 B_1,d<V_5 B_2),AND(d>V_6 B_1,d<V_6 B_2)),d,0)","v":42613},{"$f":"IF(OR(AND(d>V_1 C_1,d<V_1 C_2),AND(d>V_2 C_1,d<V_2 C_2),AND(d>V_3 C_1,d<V_3 C_2),AND(d>V_4 C_1,d<V_4 C_2),AND(d>V_5 C_1,d<V_5 C_2),AND(d>V_6 C_1,d<V_6 C_2)),d,0)","v":42613},42613,42613]
[null,null,null,null,null,null,null,null,"2016-09-01",null,{"$f":"IF(OR(AND(d>V_1 A_1,d<V_1 A_2),AND(d>V_2 A_1,d<V_2 A_2),AND(d>V_3 A_1,d<V_3 A_2),AND(d>V_4 A_1,d<V_4 A_2),AND(d>V_5 A_1,d<V_5 A_2),AND(d>V_6 A_1,d<V_6 A_2)),d,0)","v":0},{"$f":"IF(OR(AND(d>V_1 B_1,d<V_1 B_2),AND(d>V_2 B_1,d<V_2 B_2),AND(d>V_3 B_1,d<V_3 B_2),AND(d>V_4 B_1,d<V_4 B_2),AND(d>V_5 B_1,d<V_5 B_2),AND(d>V_6 B_1,d<V_6 B_2)),d,0)","v":0},{"$f":"IF(OR(AND(d>V_1 C_1,d<V_1 C_2),AND(d>V_2 C_1,d<V_2 C_2),AND(d>V_3 C_1,d<V_3 C_2),AND(d>V_4 C_1,d<V_4 C_2),AND(d>V_5 C_1,d<V_5 C_2),AND(d>V_6 C_1,d<V_6 C_2)),d,0)","v":0},0,0]
[null,null,null,null,null,null,null,null,"2016-09-02",null,{"$f":"IF(OR(AND(d>V_1 A_1,d<V_1 A_2),AND(d>V_2 A_1,d<V_2 A_2),AND(d>V_3 A_1,d<V_3 A_2),AND(d>V_4 A_1,d<V_4 A_2),AND(d>V_5 A_1,d<V_5 A_2),AND(d>V_6 A_1,d<V_6 A_2)),d,0)","v":0},{"$f":"IF(OR(AND(d>V_1 B_1,d<V_1 B_2),AND(d>V_2 B_1,d<V_2 B_2),AND(d>V_3 B_1,d<V_3 B_2),AND(d>V_4 B_1,d<V_4 B_2),AND(d>V_5 B_1,d<V_5 B_2),AND(d>V_6 B_1,d<V_6 B_2)),d,0)","v":0},{"$f":"IF(OR(AND(d>V_1 C_1,d<V_1 C_2),AND(d>V_2 C_1,d<V_2 C_2),AND(d>V_3 C_1,d<V_3 C_2),AND(d>V_4 C_1,d<V_4 C_2),AND(d>V_5 C_1,d<V_5 C_2),AND(d>V_6 C_1,d<V_6 C_2)),d,0)","v":0},0,0]
[null,null,null,null,null,null,null,null,"2016-09-03",null,{"$f":"IF(OR(AND(d>V_1 A_1,d<V_1 A_2),AND(d>V_2 A_1,d<V_2 A_2),AND(d>V_3 A_1,d<V_3 A_2),AND(d>V_4 A_1,d<V_4 A_2),AND(d>V_5 A_1,d<V_5 A_2),AND(d>V_6 A_1,d<V_6 A_2)),d,0)","v":0},{"$f":"IF(OR(AND(d>V_1 B_1,d<V_1 B_2),AND(d>V_2 B_1,d<V_2 B_2),AND(d>V_3 B_1,d<V_3 B_2),AND(d>V_4 B_1,d<V_4 B_2),AND(d>V_5 B_1,d<V_5 B_2),AND(d>V_6 B_1,d<V_6 B_2)),d,0)","v":0},{"$f":"IF(OR(AND(d>V_1 C_1,d<V_1 C_2),AND(d>V_2 C_1,d<V_2 C_2),AND(d>V_3 C_1,d<V_3 C_2),AND(d>V_4 C_1,d<V_4 C_2),AND(d>V_5 C_1,d<V_5 C_2),AND(d>V_6 C_1,d<V_6 C_2)),d,0)","v":0},0,0]
[null,null,null,null,null,null,null,null,"2016-09-04",null,{"$f":"IF(OR(AND(d>V_1 A_1,d<V_1 A_2),AND(d>V_2 A_1,d<V_2 A_2),AND(d>V_3 A_1,d<V_3 A_2),AND(d>V_4 A_1,d<V_4 A_2),AND(d>V_5 A_1,d<V_5 A_2),AND(d>V_6 A_1,d<V_6 A_2)),d,0)","v":0},{"$f":"IF(OR(AND(d>V_1 B_1,d<V_1 B_2),AND(d>V_2 B_1,d<V_2 B_2),AND(d>V_3 B_1,d<V_3 B_2),AND(d>V_4 B_1,d<V_4 B_2),AND(d>V_5 B_1,d<V_5 B_2),AND(d>V_6 B_1,d<V_6 B_2)),d,0)","v":0},{"$f":"IF(OR(AND(d>V_1 C_1,d<V_1 C_2),AND(d>V_2 C_1,d<V_2 C_2),AND(d>V_3 C_1,d<V_3 C_2),AND(d>V_4 C_1,d<V_4 C_2),AND(d>V_5 C_1,d<V_5 C_2),AND(d>V_6 C_1,d<V_6 C_2)),d,0)","v":0},0,0]
[null,null,null,null,null,null,null,null,"2016-09-05",null,{"$f":"IF(OR(AND(d>V_1 A_1,d<V_1 A_2),AND(d>V_2 A_1,d<V_2 A_2),AND(d>V_3 A_1,d<V_3 A_2),AND(d>V_4 A_1,d<V_4 A_2),AND(d>V_5 A_1,d<V_5 A_2),AND(d>V_6 A_1,d<V_6 A_2)),d,0)","v":0},{"$f":"IF(OR(AND(d>V_1 B_1,d<V_1 B_2),AND(d>V_2 B_1,d<V_2 B_2),AND(d>V_3 B_1,d<V_3 B_2),AND(d>V_4 B_1,d<V_4 B_2),AND(d>V_5 B_1,d<V_5 B_2),AND(d>V_6 B_1,d<V_6 B_2)),d,0)","v":0},{"$f":"IF(OR(AND(d>V_1 C_1,d<V_1 C_2),AND(d>V_2 C_1,d<V_2 C_2),AND(d>V_3 C_1,d<V_3 C_2),AND(d>V_4 C_1,d<V_4 C_2),AND(d>V_5 C_1,d<V_5 C_2),AND(d>V_6 C_1,d<V_6 C_2)),d,0)","v":0},0,0]
[null,null,null,null,null,null,null,null,{"$f":"I439+1","v":"2016-09-06"},null,{"$f":"IF(OR(AND(d>V_1 A_1,d<V_1 A_2),AND(d>V_2 A_1,d<V_2 A_2),AND(d>V_3 A_1,d<V_3 A_2),AND(d>V_4 A_1,d<V_4 A_2),AND(d>V_5 A_1,d<V_5 A_2),AND(d>V_6 A_1,d<V_6 A_2)),d,0)","v":0},{"$f":"IF(OR(AND(d>V_1 B_1,d<V_1 B_2),AND(d>V_2 B_1,d<V_2 B_2),AND(d>V_3 B_1,d<V_3 B_2),AND(d>V_4 B_1,d<V_4 B_2),AND(d>V_5 B_1,d<V_5 B_2),AND(d>V_6 B_1,d<V_6 B_2)),d,0)","v":0},{"$f":"IF(OR(AND(d>V_1 C_1,d<V_1 C_2),AND(d>V_2 C_1,d<V_2 C_2),AND(d>V_3 C_1,d<V_3 C_2),AND(d>V_4 C_1,d<V_4 C_2),AND(d>V_5 C_1,d<V_5 C_2),AND(d>V_6 C_1,d<V_6 C_2)),d,0)","v":0},0,0]

{"sheet":"libre","index":5,"n_rows":0,"n_cols":0,"rows_kept":0,"cut":false,"hidden":false,"merged":[]}